{"text_format":"1","workbook":"xlsx","n_sheets":7,"sheets":["201","202","203","204","205","Zbirnik po spolu","poštevanka po spolu"],"not_rendered":{"charts":0,"images":5,"macros":1,"external_links":0,"defined_names":0,"comments":0,"pivot_tables":0},"unopened":[],"bounds":{"document_bytes":16777216,"sheet_cells":100000,"rows_first":2000,"rows_last":500,"rows_between":2000,"halvings":0,"cell_chars":16384,"cell_head_chars":4096},"cells_cut":0,"cells_raw":0,"read":"whole","date_system":"1900"}

{"sheet":"201","index":0,"n_rows":36,"n_cols":25,"rows_kept":36,"cut":false,"hidden":false,"merged":[[35,0,37,8],[1,0,1,7],[2,0,2,7],[3,0,3,7],[7,0,7,9],[11,0,11,5],[8,6,8,7]]}
[]
["Spol:",null,null,null,null,null,null,null,null,{"$f":"IF(M2=0,\"Označi spol\",IF(M2=1,\"Ž\",\"M\"))","v":"Označi spol"},null,null,0,null,null,null,null,null,null,null,null,null,null,null,"4. razred"]
["Razred:",null,null,null,null,null,null,null,null,{"$f":"IF(M3=1,\"Vnesi razred\",M3+2)","v":"Vnesi razred"},null,null,1,null,null,null,null,null,null,null,null,null,null,1,"5. razred"]
["Lanska zaključena ocena pri matematiki: ",null,null,null,null,null,null,null,null,{"$f":"IF(M4=1,\"Vnesi lansko oceno\",M4-1)","v":"Vnesi lansko oceno"},null,null,1,null,null,null,null,null,null,null,null,null,null,2,"6. razred"]
[null,null,null,null,null,null,null,null,null,null,null,null,null,null,null,null,null,null,null,null,null,null,null,3,"7. razred"]
[null,null,null,null,null,null,null,null,null,null,null,null,null,null,null,null,null,null,null,null,null,null,null,4,"8. razred"]
[null,null,null,null,null,null,null,null,null,null,null,null,null,null,null,null,null,null,null,null,null,null,null,5,"9. razred"]
[{"$f":"IF(OR(M2=0,M3=1,M4=1),\"Prosim, najprej izpolni vse osnovne podatke.\",\"\")","v":"Prosim, najprej izpolni vse osnovne podatke."}]
[]
[]
[]
[]
[null,{"$f":"IF(OR(M2=0,M3=1,M4=1),\"\",StaticRand())","v":""},"∙",{"$f":"IF(OR(M2=0,M3=1,M4=1),\"\",StaticRand())","v":""},"=",null,null,{"$f":"IF(F13<>\"\",mytime(),\"\")","v":""}]
[]
["A",{"$f":"IF(F13=\"\",\"\",1)","v":""},"∙",{"$f":"IF(F13=\"\",\"\",10)","v":""},"=",null,null,{"$f":"IF(F15<>\"\",IF(H15=\"\",NOW(),H15),\"\")","v":""},{"$f":"H15-H13","v":{"$error":"#VALUE!"}},null,{"$f":"B15","v":""},{"$f":"D15","v":""},{"$f":"(B15&\" \"&C15&\" \"&D15)","v":" ∙ "},{"$f":"F15","v":0},{"$f":"K15*L15","v":{"$error":"#VALUE!"}},{"$f":"IF(F15<>\"\",IF(B15*D15=F15,1,0),\"?\")","v":"?"}]
["B",{"$f":"IF(F15=\"\",\"\",4)","v":""},"∙",{"$f":"IF(F15=\"\",\"\",7)","v":""},"=",null,null,"",{"$f":"H16-H15","v":{"$error":"#VALUE!"}},null,"",""," ∙ ",0,{"$f":"K16*L16","v":{"$error":"#VALUE!"}},"?"]
["C",{"$f":"IF(F16=\"\",\"\",5)","v":""},"∙",{"$f":"IF(F16=\"\",\"\",8)","v":""},"=",null,null,"",{"$f":"H17-H16","v":{"$error":"#VALUE!"}},null,"",""," ∙ ",0,{"$error":"#VALUE!"},"?"]
["D",{"$f":"IF(F17=\"\",\"\",8)","v":""},"∙",{"$f":"IF(F17=\"\",\"\",9)","v":""},"=",null,null,"",{"$error":"#VALUE!"},null,"",""," ∙ ",0,{"$error":"#VALUE!"},"?"]
["E",{"$f":"IF(F18=\"\",\"\",7)","v":""},"∙",{"$f":"IF(F18=\"\",\"\",3)","v":""},"=",null,null,"",{"$error":"#VALUE!"},null,"",""," ∙ ",0,{"$error":"#VALUE!"},"?"]
["F",{"$f":"IF(F19=\"\",\"\",10)","v":""},"∙",{"$f":"IF(F19=\"\",\"\",1)","v":""},"=",null,null,"",{"$error":"#VALUE!"},null,"",""," ∙ ",0,{"$error":"#VALUE!"},"?"]
["G",{"$f":"IF(F20=\"\",\"\",6)","v":""},"∙",{"$f":"IF(F20=\"\",\"\",2)","v":""},"=",null,null,"",{"$error":"#VALUE!"},null,"",""," ∙ ",0,{"$error":"#VALUE!"},"?"]
["H",{"$f":"IF(F21=\"\",\"\",9)","v":""},"∙",{"$f":"IF(F21=\"\",\"\",6)","v":""},"=",null,null,"",{"$error":"#VALUE!"},null,"",""," ∙ ",0,{"$error":"#VALUE!"},"?"]
["I",{"$f":"IF(F22=\"\",\"\",5)","v":""},"∙",{"$f":"IF(F22=\"\",\"\",10)","v":""},"=",null,null,"",{"$error":"#VALUE!"},null,"",""," ∙ ",0,{"$error":"#VALUE!"},"?"]
["J",{"$f":"IF(F23=\"\",\"\",4)","v":""},"∙",{"$f":"IF(F23=\"\",\"\",4)","v":""},"=",null,null,"",{"$error":"#VALUE!"},null,"",""," ∙ ",0,{"$error":"#VALUE!"},"?"]
["K",{"$f":"IF(F24=\"\",\"\",7)","v":""},"∙",{"$f":"IF(F24=\"\",\"\",10)","v":""},"=",null,null,"",{"$error":"#VALUE!"},null,"",""," ∙ ",0,{"$error":"#VALUE!"},"?"]
["L",{"$f":"IF(F25=\"\",\"\",10)","v":""},"∙",{"$f":"IF(F25=\"\",\"\",3)","v":""},"=",null,null,"",{"$error":"#VALUE!"},null,"",""," ∙ ",0,{"$error":"#VALUE!"},"?"]
["M",{"$f":"IF(F26=\"\",\"\",6)","v":""},"∙",{"$f":"IF(F26=\"\",\"\",10)","v":""},"=",null,null,"",{"$error":"#VALUE!"},null,"",""," ∙ ",0,{"$error":"#VALUE!"},"?"]
["N",{"$f":"IF(F27=\"\",\"\",1)","v":""},"∙",{"$f":"IF(F27=\"\",\"\",7)","v":""},"=",null,null,"",{"$error":"#VALUE!"},null,"",""," ∙ ",0,{"$error":"#VALUE!"},"?"]
["O",{"$f":"IF(F28=\"\",\"\",4)","v":""},"∙",{"$f":"IF(F26=\"\",\"\",6)","v":""},"=",null,null,"",{"$error":"#VALUE!"},null,"",""," ∙ ",0,{"$error":"#VALUE!"},"?"]
["P",{"$f":"IF(F29=\"\",\"\",9)","v":""},"∙",{"$f":"IF(F29=\"\",\"\",5)","v":""},"=",null,null,"",{"$error":"#VALUE!"},null,"",""," ∙ ",0,{"$error":"#VALUE!"},"?"]
["R",{"$f":"IF(F30=\"\",\"\",10)","v":""},"∙",{"$f":"IF(F30=\"\",\"\",7)","v":""},"=",null,null,"",{"$error":"#VALUE!"},null,"",""," ∙ ",0,{"$error":"#VALUE!"},"?"]
["S",{"$f":"IF(F31=\"\",\"\",1)","v":""},"∙",{"$f":"IF(F31=\"\",\"\",2)","v":""},"=",null,null,"",{"$error":"#VALUE!"},null,"",""," ∙ ",0,{"$error":"#VALUE!"},"?"]
["T",{"$f":"IF(F32=\"\",\"\",1)","v":""},"∙",{"$f":"IF(F32=\"\",\"\",8)","v":""},"=",null,null,"",{"$error":"#VALUE!"},null,"",""," ∙ ",0,{"$error":"#VALUE!"},"?"]
["U",{"$f":"IF(F33=\"\",\"\",5)","v":""},"∙",{"$f":"IF(F33=\"\",\"\",1)","v":""},"=",null,null,"",{"$error":"#VALUE!"},null,"",""," ∙ ",0,{"$error":"#VALUE!"},"?"]
[]
["HVALA ZA SODELOVANJE!"]

{"sheet":"202","index":1,"n_rows":36,"n_cols":25,"rows_kept":36,"cut":false,"hidden":false,"merged":[[11,0,11,5],[35,0,37,8],[1,0,1,7],[2,0,2,7],[3,0,3,7],[7,0,7,9],[8,6,8,7]]}
[]
["Spol:",null,null,null,null,null,null,null,null,{"$f":"IF(M2=0,\"Označi spol\",IF(M2=1,\"Ž\",\"M\"))","v":"Označi spol"},null,null,0,null,null,null,null,null,null,null,null,null,null,null,"4. razred"]
["Razred:",null,null,null,null,null,null,null,null,{"$f":"IF(M3=1,\"Vnesi razred\",M3+2)","v":"Vnesi razred"},null,null,1,null,null,null,null,null,null,null,null,null,null,1,"5. razred"]
["Lanska zaključena ocena pri matematiki: ",null,null,null,null,null,null,null,null,{"$f":"IF(M4=1,\"Vnesi lansko oceno\",M4-1)","v":"Vnesi lansko oceno"},null,null,1,null,null,null,null,null,null,null,null,null,null,2,"6. razred"]
[null,null,null,null,null,null,null,null,null,null,null,null,null,null,null,null,null,null,null,null,null,null,null,3,"7. razred"]
[null,null,null,null,null,null,null,null,null,null,null,null,null,null,null,null,null,null,null,null,null,null,null,4,"8. razred"]
[null,null,null,null,null,null,null,null,null,null,null,null,null,null,null,null,null,null,null,null,null,null,null,5,"9. razred"]
[{"$f":"IF(OR(M2=0,M3=1,M4=1),\"Prosim, najprej izpolni vse osnovne podatke.\",\"\")","v":"Prosim, najprej izpolni vse osnovne podatke."}]
[]
[]
[]
[]
[null,{"$f":"IF(OR(M2=0,M3=1,M4=1),\"\",StaticRand())","v":""},"∙",{"$f":"IF(OR(M2=0,M3=1,M4=1),\"\",StaticRand())","v":""},"=",null,null,{"$f":"IF(F13<>\"\",mytime(),\"\")","v":""}]
[]
["A",{"$f":"IF(F13=\"\",\"\",3)","v":""},"∙",{"$f":"IF(F13=\"\",\"\",1)","v":""},"=",null,null,{"$f":"IF(F15<>\"\",IF(H15=\"\",NOW(),H15),\"\")","v":""},{"$f":"H15-H13","v":{"$error":"#VALUE!"}},null,{"$f":"B15","v":""},{"$f":"D15","v":""},{"$f":"(B15&\" \"&C15&\" \"&D15)","v":" ∙ "},{"$f":"F15","v":0},{"$f":"K15*L15","v":{"$error":"#VALUE!"}},{"$f":"IF(F15<>\"\",IF(B15*D15=F15,1,0),\"?\")","v":"?"}]
["B",{"$f":"IF(F15=\"\",\"\",2)","v":""},"∙",{"$f":"IF(F15=\"\",\"\",7)","v":""},"=",null,null,"",{"$f":"H16-H15","v":{"$error":"#VALUE!"}},null,"","",{"$f":"(B16&\" \"&C16&\" \"&D16)","v":" ∙ "},0,{"$f":"K16*L16","v":{"$error":"#VALUE!"}},"?"]
["C",{"$f":"IF(F16=\"\",\"\",5)","v":""},"∙",{"$f":"IF(F16=\"\",\"\",4)","v":""},"=",null,null,"",{"$f":"H17-H16","v":{"$error":"#VALUE!"}},null,"","",{"$f":"(B17&\" \"&C17&\" \"&D17)","v":" ∙ "},0,{"$error":"#VALUE!"},"?"]
["D",{"$f":"IF(F17=\"\",\"\",3)","v":""},"∙",{"$f":"IF(F17=\"\",\"\",6)","v":""},"=",null,null,"",{"$error":"#VALUE!"},null,"",""," ∙ ",0,{"$error":"#VALUE!"},"?"]
["E",{"$f":"IF(F18=\"\",\"\",8)","v":""},"∙",{"$f":"IF(F18=\"\",\"\",7)","v":""},"=",null,null,"",{"$error":"#VALUE!"},null,"",""," ∙ ",0,{"$error":"#VALUE!"},"?"]
["F",{"$f":"IF(F19=\"\",\"\",1)","v":""},"∙",{"$f":"IF(F19=\"\",\"\",1)","v":""},"=",null,null,"",{"$error":"#VALUE!"},null,"",""," ∙ ",0,{"$error":"#VALUE!"},"?"]
["G",{"$f":"IF(F20=\"\",\"\",3)","v":""},"∙",{"$f":"IF(F20=\"\",\"\",7)","v":""},"=",null,null,"",{"$error":"#VALUE!"},null,"",""," ∙ ",0,{"$error":"#VALUE!"},"?"]
["H",{"$f":"IF(F21=\"\",\"\",10)","v":""},"∙",{"$f":"IF(F21=\"\",\"\",4)","v":""},"=",null,null,"",{"$error":"#VALUE!"},null,"",""," ∙ ",0,{"$error":"#VALUE!"},"?"]
["I",{"$f":"IF(F22=\"\",\"\",7)","v":""},"∙",{"$f":"IF(F22=\"\",\"\",5)","v":""},"=",null,null,"",{"$error":"#VALUE!"},null,"",""," ∙ ",0,{"$error":"#VALUE!"},"?"]
["J",{"$f":"IF(F23=\"\",\"\",9)","v":""},"∙",{"$f":"IF(F23=\"\",\"\",8)","v":""},"=",null,null,"",{"$error":"#VALUE!"},null,"",""," ∙ ",0,{"$error":"#VALUE!"},"?"]
["K",{"$f":"IF(F24=\"\",\"\",8)","v":""},"∙",{"$f":"IF(F24=\"\",\"\",4)","v":""},"=",null,null,"",{"$error":"#VALUE!"},null,"",""," ∙ ",0,{"$error":"#VALUE!"},"?"]
["L",{"$f":"IF(F25=\"\",\"\",10)","v":""},"∙",{"$f":"IF(F25=\"\",\"\",10)","v":""},"=",null,null,"",{"$error":"#VALUE!"},null,"",""," ∙ ",0,{"$error":"#VALUE!"},"?"]
["M",{"$f":"IF(F26=\"\",\"\",6)","v":""},"∙",{"$f":"IF(F26=\"\",\"\",3)","v":""},"=",null,null,"",{"$error":"#VALUE!"},null,"",""," ∙ ",0,{"$error":"#VALUE!"},"?"]
["N",{"$f":"IF(F27=\"\",\"\",2)","v":""},"∙",{"$f":"IF(F27=\"\",\"\",2)","v":""},"=",null,null,"",{"$error":"#VALUE!"},null,"",""," ∙ ",0,{"$error":"#VALUE!"},"?"]
["O",{"$f":"IF(F28=\"\",\"\",7)","v":""},"∙",{"$f":"IF(F28=\"\",\"\",6)","v":""},"=",null,null,"",{"$error":"#VALUE!"},null,"",""," ∙ ",0,{"$error":"#VALUE!"},"?"]
["P",{"$f":"IF(F29=\"\",\"\",9)","v":""},"∙",{"$f":"IF(F29=\"\",\"\",3)","v":""},"=",null,null,"",{"$error":"#VALUE!"},null,"",""," ∙ ",{"$f":"F30","v":0},{"$error":"#VALUE!"},"?"]
["R",{"$f":"IF(F30=\"\",\"\",8)","v":""},"∙",{"$f":"IF(F30=\"\",\"\",3)","v":""},"=",null,null,"",{"$error":"#VALUE!"},null,"",""," ∙ ",0,{"$error":"#VALUE!"},"?"]
["S",{"$f":"IF(F31=\"\",\"\",10)","v":""},"∙",{"$f":"IF(F31=\"\",\"\",2)","v":""},"=",null,null,"",{"$error":"#VALUE!"},null,"",""," ∙ ",0,{"$error":"#VALUE!"},"?"]
["T",{"$f":"IF(F32=\"\",\"\",4)","v":""},"∙",{"$f":"IF(F32=\"\",\"\",5)","v":""},"=",null,null,"",{"$error":"#VALUE!"},null,"",""," ∙ ",0,{"$error":"#VALUE!"},"?"]
["U",{"$f":"IF(F33=\"\",\"\",4)","v":""},"∙",{"$f":"IF(F33=\"\",\"\",10)","v":""},"=",null,null,"",{"$error":"#VALUE!"},null,"",""," ∙ ",0,{"$error":"#VALUE!"},"?"]
[]
["HVALA ZA SODELOVANJE!"]

{"sheet":"203","index":2,"n_rows":36,"n_cols":25,"rows_kept":36,"cut":false,"hidden":false,"merged":[[35,0,37,8],[1,0,1,7],[2,0,2,7],[3,0,3,7],[7,0,7,9],[8,6,8,7],[11,0,11,5]]}
[]
["Spol:",null,null,null,null,null,null,null,null,{"$f":"IF(M2=0,\"Označi spol\",IF(M2=1,\"Ž\",\"M\"))","v":"Označi spol"},null,null,0,null,null,null,null,null,null,null,null,null,null,null,"4. razred"]
["Razred:",null,null,null,null,null,null,null,null,{"$f":"IF(M3=1,\"Vnesi razred\",M3+2)","v":"Vnesi razred"},null,null,1,null,null,null,null,null,null,null,null,null,null,1,"5. razred"]
["Lanska zaključena ocena pri matematiki: ",null,null,null,null,null,null,null,null,{"$f":"IF(M4=1,\"Vnesi lansko oceno\",M4-1)","v":"Vnesi lansko oceno"},null,null,1,null,null,null,null,null,null,null,null,null,null,2,"6. razred"]
[null,null,null,null,null,null,null,null,null,null,null,null,null,null,null,null,null,null,null,null,null,null,null,3,"7. razred"]
[null,null,null,null,null,null,null,null,null,null,null,null,null,null,null,null,null,null,null,null,null,null,null,4,"8. razred"]
[null,null,null,null,null,null,null,null,null,null,null,null,null,null,null,null,null,null,null,null,null,null,null,5,"9. razred"]
[{"$f":"IF(OR(M2=0,M3=1,M4=1),\"Prosim, najprej izpolni vse osnovne podatke.\",\"\")","v":"Prosim, najprej izpolni vse osnovne podatke."}]
[]
[]
[]
[]
[null,{"$f":"IF(OR(M2=0,M3=1,M4=1),\"\",1)","v":""},"∙",{"$f":"IF(OR(M2=0,M3=1,M4=1),\"\",8)","v":""},"=",null,null,{"$f":"IF(F13<>\"\",mytime(),\"\")","v":""}]
[]
["A",{"$f":"IF(F13=\"\",\"\",6)","v":""},"∙",{"$f":"IF(F13=\"\",\"\",1)","v":""},"=",null,null,{"$f":"IF(F15<>\"\",IF(H15=\"\",NOW(),H15),\"\")","v":""},{"$f":"H15-H13","v":{"$error":"#VALUE!"}},null,{"$f":"B15","v":""},{"$f":"D15","v":""},{"$f":"(B15&\" \"&C15&\" \"&D15)","v":" ∙ "},{"$f":"F15","v":0},{"$f":"K15*L15","v":{"$error":"#VALUE!"}},{"$f":"IF(F15<>\"\",IF(B15*D15=F15,1,0),\"?\")","v":"?"}]
["B",{"$f":"IF(F15=\"\",\"\",2)","v":""},"∙",{"$f":"IF(F15=\"\",\"\",5)","v":""},"=",null,null,"",{"$f":"H16-H15","v":{"$error":"#VALUE!"}},null,"","",{"$f":"(B16&\" \"&C16&\" \"&D16)","v":" ∙ "},0,{"$f":"K16*L16","v":{"$error":"#VALUE!"}},"?"]
["C",{"$f":"IF(F16=\"\",\"\",6)","v":""},"∙",{"$f":"IF(F16=\"\",\"\",9)","v":""},"=",null,null,"",{"$f":"H17-H16","v":{"$error":"#VALUE!"}},null,"","",{"$f":"(B17&\" \"&C17&\" \"&D17)","v":" ∙ "},0,{"$error":"#VALUE!"},"?"]
["D",{"$f":"IF(F17=\"\",\"\",3)","v":""},"∙",{"$f":"IF(F17=\"\",\"\",4)","v":""},"=",null,null,"",{"$error":"#VALUE!"},null,"",""," ∙ ",0,{"$error":"#VALUE!"},"?"]
["E",{"$f":"IF(F18=\"\",\"\",5)","v":""},"∙",{"$f":"IF(F18=\"\",\"\",7)","v":""},"=",null,null,"",{"$error":"#VALUE!"},null,"",""," ∙ ",0,{"$error":"#VALUE!"},"?"]
["F",{"$f":"IF(F19=\"\",\"\",2)","v":""},"∙",{"$f":"IF(F19=\"\",\"\",3)","v":""},"=",null,null,"",{"$error":"#VALUE!"},null,"",""," ∙ ",0,{"$error":"#VALUE!"},"?"]
["G",{"$f":"IF(F20=\"\",\"\",8)","v":""},"∙",{"$f":"IF(F20=\"\",\"\",6)","v":""},"=",null,null,"",{"$error":"#VALUE!"},null,"",""," ∙ ",0,{"$error":"#VALUE!"},"?"]
["H",{"$f":"IF(F21=\"\",\"\",3)","v":""},"∙",{"$f":"IF(F21=\"\",\"\",2)","v":""},"=",null,null,"",{"$error":"#VALUE!"},null,"",""," ∙ ",0,{"$error":"#VALUE!"},"?"]
["I",{"$f":"IF(F22=\"\",\"\",3)","v":""},"∙",{"$f":"IF(F22=\"\",\"\",10)","v":""},"=",null,null,"",{"$error":"#VALUE!"},null,"",""," ∙ ",0,{"$error":"#VALUE!"},"?"]
["J",{"$f":"IF(F23=\"\",\"\",9)","v":""},"∙",{"$f":"IF(F23=\"\",\"\",1)","v":""},"=",null,null,"",{"$error":"#VALUE!"},null,"",""," ∙ ",0,{"$error":"#VALUE!"},"?"]
["K",{"$f":"IF(F24=\"\",\"\",8)","v":""},"∙",{"$f":"IF(F24=\"\",\"\",1)","v":""},"=",null,null,"",{"$error":"#VALUE!"},null,"",""," ∙ ",0,{"$error":"#VALUE!"},"?"]
["L",{"$f":"IF(F25=\"\",\"\",1)","v":""},"∙",{"$f":"IF(F25=\"\",\"\",5)","v":""},"=",null,null,"",{"$error":"#VALUE!"},null,"",""," ∙ ",0,{"$error":"#VALUE!"},"?"]
["M",{"$f":"IF(F26=\"\",\"\",3)","v":""},"∙",{"$f":"IF(F26=\"\",\"\",9)","v":""},"=",null,null,"",{"$error":"#VALUE!"},null,"",""," ∙ ",0,{"$error":"#VALUE!"},"?"]
["N",{"$f":"IF(F27=\"\",\"\",2)","v":""},"∙",{"$f":"IF(F27=\"\",\"\",1)","v":""},"=",null,null,"",{"$error":"#VALUE!"},null,"",""," ∙ ",0,{"$error":"#VALUE!"},"?"]
["O",{"$f":"IF(F28=\"\",\"\",7)","v":""},"∙",{"$f":"IF(F28=\"\",\"\",9)","v":""},"=",null,null,"",{"$error":"#VALUE!"},null,"",""," ∙ ",0,{"$error":"#VALUE!"},"?"]
["P",{"$f":"IF(F29=\"\",\"\",9)","v":""},"∙",{"$f":"IF(F29=\"\",\"\",9)","v":""},"=",null,null,"",{"$error":"#VALUE!"},null,"",""," ∙ ",0,{"$error":"#VALUE!"},"?"]
["R",{"$f":"IF(F30=\"\",\"\",1)","v":""},"∙",{"$f":"IF(F30=\"\",\"\",4)","v":""},"=",null,null,"",{"$error":"#VALUE!"},null,"",""," ∙ ",0,{"$error":"#VALUE!"},"?"]
["S",{"$f":"IF(F31=\"\",\"\",10)","v":""},"∙",{"$f":"IF(F31=\"\",\"\",6)","v":""},"=",null,null,"",{"$error":"#VALUE!"},null,"",""," ∙ ",0,{"$error":"#VALUE!"},"?"]
["T",{"$f":"IF(F32=\"\",\"\",6)","v":""},"∙",{"$f":"IF(F32=\"\",\"\",4)","v":""},"=",null,null,"",{"$error":"#VALUE!"},null,"",""," ∙ ",0,{"$error":"#VALUE!"},"?"]
["U",{"$f":"IF(F33=\"\",\"\",7)","v":""},"∙",{"$f":"IF(F33=\"\",\"\",2)","v":""},"=",null,null,"",{"$error":"#VALUE!"},null,"",""," ∙ ",0,{"$error":"#VALUE!"},"?"]
[]
["HVALA ZA SODELOVANJE!"]

{"sheet":"204","index":3,"n_rows":36,"n_cols":25,"rows_kept":36,"cut":false,"hidden":false,"merged":[[35,0,37,8],[1,0,1,7],[2,0,2,7],[3,0,3,7],[7,0,7,9],[8,6,8,7],[11,0,11,5]]}
[]
["Spol:",null,null,null,null,null,null,null,null,{"$f":"IF(M2=0,\"Označi spol\",IF(M2=1,\"Ž\",\"M\"))","v":"Označi spol"},null,null,0,null,null,null,null,null,null,null,null,null,null,null,"4. razred"]
["Razred:",null,null,null,null,null,null,null,null,{"$f":"IF(M3=1,\"Vnesi razred\",M3+2)","v":"Vnesi razred"},null,null,1,null,null,null,null,null,null,null,null,null,null,1,"5. razred"]
["Lanska zaključena ocena pri matematiki: ",null,null,null,null,null,null,null,null,{"$f":"IF(M4=1,\"Vnesi lansko oceno\",M4-1)","v":"Vnesi lansko oceno"},null,null,1,null,null,null,null,null,null,null,null,null,null,2,"6. razred"]
[null,null,null,null,null,null,null,null,null,null,null,null,null,null,null,null,null,null,null,null,null,null,null,3,"7. razred"]
[null,null,null,null,null,null,null,null,null,null,null,null,null,null,null,null,null,null,null,null,null,null,null,4,"8. razred"]
[null,null,null,null,null,null,null,null,null,null,null,null,null,null,null,null,null,null,null,null,null,null,null,5,"9. razred"]
[{"$f":"IF(OR(M2=0,M3=1,M4=1),\"Prosim, najprej izpolni vse osnovne podatke.\",\"\")","v":"Prosim, najprej izpolni vse osnovne podatke."}]
[]
[]
[]
[]
[null,7,"∙",3,"=",null,null,{"$f":"IF(F13<>\"\",IF(H13=\"\",NOW(),H13),\"\")","v":""}]
[]
["A",{"$f":"IF(F13=\"\",\"\",3)","v":""},"∙",{"$f":"IF(F13=\"\",\"\",3)","v":""},"=",null,null,{"$f":"IF(F15<>\"\",IF(H15=\"\",NOW(),H15),\"\")","v":""},{"$f":"H15-H13","v":{"$error":"#VALUE!"}},null,{"$f":"B15","v":""},{"$f":"D15","v":""},{"$f":"(B15&\" \"&C15&\" \"&D15)","v":" ∙ "},{"$f":"F15","v":0},{"$f":"K15*L15","v":{"$error":"#VALUE!"}},{"$f":"IF(F17<>\"\",IF(B17*D17=F17,1,0),\"?\")","v":"?"}]
["B",{"$f":"IF(F15=\"\",\"\",2)","v":""},"∙",{"$f":"IF(F15=\"\",\"\",6)","v":""},"=",null,null,"",{"$f":"H16-H15","v":{"$error":"#VALUE!"}},null,{"$f":"B16","v":""},{"$f":"D16","v":""},{"$f":"(B16&\" \"&C16&\" \"&D16)","v":" ∙ "},{"$f":"F16","v":0},{"$f":"K16*L16","v":{"$error":"#VALUE!"}},{"$f":"IF(F13<>\"\",IF(B13*D13=F13,1,0),\"?\")","v":"?"}]
["C",{"$f":"IF(F16=\"\",\"\",5)","v":""},"∙",{"$f":"IF(F16=\"\",\"\",2)","v":""},"=",null,null,"",{"$f":"H17-H16","v":{"$error":"#VALUE!"}},null,"","",{"$f":"(B17&\" \"&C17&\" \"&D17)","v":" ∙ "},0,{"$error":"#VALUE!"},{"$f":"IF(F17<>\"\",IF(B17*D17=F17,1,0),\"?\")","v":"?"}]
["D",{"$f":"IF(F17=\"\",\"\",4)","v":""},"∙",{"$f":"IF(F17=\"\",\"\",1)","v":""},"=",null,null,"",{"$error":"#VALUE!"},null,"",""," ∙ ",0,{"$error":"#VALUE!"},"?"]
["E",{"$f":"IF(F18=\"\",\"\",7)","v":""},"∙",{"$f":"IF(F18=\"\",\"\",7)","v":""},"=",null,null,"",{"$error":"#VALUE!"},null,"",""," ∙ ",0,{"$error":"#VALUE!"},"?"]
["F",{"$f":"IF(F19=\"\",\"\",2)","v":""},"∙",{"$f":"IF(F19=\"\",\"\",9)","v":""},"=",null,null,"",{"$error":"#VALUE!"},null,"",""," ∙ ",0,{"$error":"#VALUE!"},"?"]
["G",{"$f":"IF(F20=\"\",\"\",8)","v":""},"∙",{"$f":"IF(F20=\"\",\"\",8)","v":""},"=",null,null,"",{"$error":"#VALUE!"},null,"",""," ∙ ",0,{"$error":"#VALUE!"},"?"]
["H",{"$f":"IF(F21=\"\",\"\",4)","v":""},"∙",{"$f":"IF(F21=\"\",\"\",2)","v":""},"=",null,null,"",{"$error":"#VALUE!"},null,"",""," ∙ ",0,{"$error":"#VALUE!"},"?"]
["I",{"$f":"IF(F22=\"\",\"\",2)","v":""},"∙",{"$f":"IF(F22=\"\",\"\",8)","v":""},"=",null,null,"",{"$error":"#VALUE!"},null,"",""," ∙ ",0,{"$error":"#VALUE!"},"?"]
["J",{"$f":"IF(F23=\"\",\"\",9)","v":""},"∙",{"$f":"IF(F23=\"\",\"\",10)","v":""},"=",null,null,"",{"$error":"#VALUE!"},null,"",""," ∙ ",0,{"$error":"#VALUE!"},"?"]
["K",{"$f":"IF(F24=\"\",\"\",8)","v":""},"∙",{"$f":"IF(F24=\"\",\"\",10)","v":""},"=",null,null,"",{"$error":"#VALUE!"},null,"",""," ∙ ",0,{"$error":"#VALUE!"},{"$f":"IF(F27<>\"\",IF(B27*D27=F27,1,0),\"?\")","v":"?"}]
["L",{"$f":"IF(F25=\"\",\"\",1)","v":""},"∙",{"$f":"IF(F25=\"\",\"\",9)","v":""},"=",null,null,"",{"$error":"#VALUE!"},null,"",""," ∙ ",0,{"$error":"#VALUE!"},{"$f":"IF(F23<>\"\",IF(B23*D23=F23,1,0),\"?\")","v":"?"}]
["M",{"$f":"IF(F26=\"\",\"\",4)","v":""},"∙",{"$f":"IF(F26=\"\",\"\",3)","v":""},"=",null,null,"",{"$error":"#VALUE!"},null,"",""," ∙ ",0,{"$error":"#VALUE!"},"?"]
["N",{"$f":"IF(F27=\"\",\"\",3)","v":""},"∙",{"$f":"IF(F27=\"\",\"\",5)","v":""},"=",null,null,"",{"$error":"#VALUE!"},null,"",""," ∙ ",0,{"$error":"#VALUE!"},"?"]
["O",{"$f":"IF(F28=\"\",\"\",4)","v":""},"∙",{"$f":"IF(F28=\"\",\"\",9)","v":""},"=",null,null,"",{"$error":"#VALUE!"},null,"",""," ∙ ",0,{"$error":"#VALUE!"},"?"]
["P",{"$f":"IF(F29=\"\",\"\",9)","v":""},"∙",{"$f":"IF(F29=\"\",\"\",2)","v":""},"=",null,null,"",{"$error":"#VALUE!"},null,"",""," ∙ ",0,{"$error":"#VALUE!"},"?"]
["R",{"$f":"IF(F30=\"\",\"\",5)","v":""},"∙",{"$f":"IF(F30=\"\",\"\",3)","v":""},"=",null,null,"",{"$error":"#VALUE!"},null,"",""," ∙ ",0,{"$error":"#VALUE!"},"?"]
["S",{"$f":"IF(F31=\"\",\"\",10)","v":""},"∙",{"$f":"IF(F31=\"\",\"\",5)","v":""},"=",null,null,"",{"$error":"#VALUE!"},null,"",""," ∙ ",0,{"$error":"#VALUE!"},"?"]
["T",{"$f":"IF(F32=\"\",\"\",6)","v":""},"∙",{"$f":"IF(F32=\"\",\"\",6)","v":""},"=",null,null,"",{"$error":"#VALUE!"},null,"",""," ∙ ",0,{"$error":"#VALUE!"},"?"]
["U",{"$f":"IF(F33=\"\",\"\",4)","v":""},"∙",{"$f":"IF(F33=\"\",\"\",8)","v":""},"=",null,null,"",{"$error":"#VALUE!"},null,"",""," ∙ ",0,{"$error":"#VALUE!"},"?"]
[]
["HVALA ZA SODELOVANJE!"]

{"sheet":"205","index":4,"n_rows":36,"n_cols":25,"rows_kept":36,"cut":false,"hidden":false,"merged":[[35,0,37,8],[1,0,1,7],[2,0,2,7],[3,0,3,7],[7,0,7,9],[8,6,8,7],[11,0,11,5]]}
[]
["Spol:",null,null,null,null,null,null,null,null,{"$f":"IF(M2=0,\"Označi spol\",IF(M2=1,\"Ž\",\"M\"))","v":"Označi spol"},null,null,0,null,null,null,null,null,null,null,null,null,null,null,"4. razred"]
["Razred:",null,null,null,null,null,null,null,null,{"$f":"IF(M3=1,\"Vnesi razred\",M3+2)","v":"Vnesi razred"},null,null,1,null,null,null,null,null,null,null,null,null,null,1,"5. razred"]
["Lanska zaključena ocena pri matematiki: ",null,null,null,null,null,null,null,null,{"$f":"IF(M4=1,\"Vnesi lansko oceno\",M4-1)","v":"Vnesi lansko oceno"},null,null,1,null,null,null,null,null,null,null,null,null,null,2,"6. razred"]
[null,null,null,null,null,null,null,null,null,null,null,null,null,null,null,null,null,null,null,null,null,null,null,3,"7. razred"]
[null,null,null,null,null,null,null,null,null,null,null,null,null,null,null,null,null,null,null,null,null,null,null,4,"8. razred"]
[null,null,null,null,null,null,null,null,null,null,null,null,null,null,null,null,null,null,null,null,null,null,null,5,"9. razred"]
[{"$f":"IF(OR(M2=0,M3=1,M4=1),\"Prosim, najprej izpolni vse osnovne podatke.\",\"\")","v":"Prosim, najprej izpolni vse osnovne podatke."}]
[]
[]
[]
[]
[null,5,"∙",3,"=",null,null,{"$f":"IF(F13<>\"\",mytime(),\"\")","v":""}]
[]
["A",{"$f":"IF(F13=\"\",\"\",6)","v":""},"∙",{"$f":"IF(F13=\"\",\"\",8)","v":""},"=",null,null,{"$f":"IF(F15<>\"\",IF(H15=\"\",NOW(),H15),\"\")","v":""},{"$f":"H15-H13","v":{"$error":"#VALUE!"}},null,{"$f":"B15","v":""},{"$f":"D15","v":""},{"$f":"(B15&\" \"&C15&\" \"&D15)","v":" ∙ "},{"$f":"F15","v":0},{"$f":"K15*L15","v":{"$error":"#VALUE!"}},{"$f":"IF(F15<>\"\",IF(B15*D15=F15,1,0),\"?\")","v":"?"}]
["B",{"$f":"IF(F15=\"\",\"\",2)","v":""},"∙",{"$f":"IF(F15=\"\",\"\",4)","v":""},"=",null,null,"",{"$f":"H16-H15","v":{"$error":"#VALUE!"}},null,"","",{"$f":"(B16&\" \"&C16&\" \"&D16)","v":" ∙ "},0,{"$f":"K16*L16","v":{"$error":"#VALUE!"}},"?"]
["C",{"$f":"IF(F16=\"\",\"\",6)","v":""},"∙",{"$f":"IF(F16=\"\",\"\",7)","v":""},"=",null,null,"",{"$f":"H17-H16","v":{"$error":"#VALUE!"}},null,"","",{"$f":"(B17&\" \"&C17&\" \"&D17)","v":" ∙ "},0,{"$error":"#VALUE!"},"?"]
["D",{"$f":"IF(F17=\"\",\"\",3)","v":""},"∙",{"$f":"IF(F17=\"\",\"\",StaticRand())","v":""},"=",null,null,"",{"$error":"#VALUE!"},null,"","",{"$f":"(B18&\" \"&C18&\" \"&D18)","v":" ∙ "},0,{"$error":"#VALUE!"},"?"]
["E",{"$f":"IF(F18=\"\",\"\",5)","v":""},"∙",{"$f":"IF(F18=\"\",\"\",5)","v":""},"=",null,null,"",{"$error":"#VALUE!"},null,"",""," ∙ ",0,{"$error":"#VALUE!"},"?"]
["F",{"$f":"IF(F19=\"\",\"\",5)","v":""},"∙",{"$f":"IF(F19=\"\",\"\",9)","v":""},"=",null,null,"",{"$error":"#VALUE!"},null,"",""," ∙ ",0,{"$error":"#VALUE!"},"?"]
["G",{"$f":"IF(F20=\"\",\"\",8)","v":""},"∙",{"$f":"IF(F20=\"\",\"\",5)","v":""},"=",null,null,"",{"$error":"#VALUE!"},null,"",""," ∙ ",0,{"$error":"#VALUE!"},"?"]
["H",{"$f":"IF(F21=\"\",\"\",7)","v":""},"∙",{"$f":"IF(F21=\"\",\"\",8)","v":""},"=",null,null,"",{"$error":"#VALUE!"},null,"",""," ∙ ",0,{"$error":"#VALUE!"},"?"]
["I",{"$f":"IF(F22=\"\",\"\",7)","v":""},"∙",{"$f":"IF(F22=\"\",\"\",4)","v":""},"=",null,null,"",{"$error":"#VALUE!"},null,"",""," ∙ ",0,{"$error":"#VALUE!"},"?"]
["J",{"$f":"IF(F23=\"\",\"\",9)","v":""},"∙",{"$f":"IF(F23=\"\",\"\",7)","v":""},"=",null,null,"",{"$error":"#VALUE!"},null,"",""," ∙ ",0,{"$error":"#VALUE!"},"?"]
["K",{"$f":"IF(F24=\"\",\"\",8)","v":""},"∙",{"$f":"IF(F24=\"\",\"\",2)","v":""},"=",null,null,"",{"$error":"#VALUE!"},null,"",""," ∙ ",0,{"$error":"#VALUE!"},"?"]
["L",{"$f":"IF(F25=\"\",\"\",1)","v":""},"∙",{"$f":"IF(F25=\"\",\"\",6)","v":""},"=",null,null,"",{"$error":"#VALUE!"},null,"",""," ∙ ",0,{"$error":"#VALUE!"},"?"]
["M",{"$f":"IF(F26=\"\",\"\",1)","v":""},"∙",{"$f":"IF(F26=\"\",\"\",3)","v":""},"=",null,null,"",{"$error":"#VALUE!"},null,"",""," ∙ ",0,{"$error":"#VALUE!"},"?"]
["N",{"$f":"IF(F27=\"\",\"\",2)","v":""},"∙",{"$f":"IF(F27=\"\",\"\",10)","v":""},"=",null,null,"",{"$error":"#VALUE!"},null,"",""," ∙ ",0,{"$error":"#VALUE!"},"?"]
["O",{"$f":"IF(F28=\"\",\"\",7)","v":""},"∙",{"$f":"IF(F28=\"\",\"\",1)","v":""},"=",null,null,"",{"$error":"#VALUE!"},null,"",""," ∙ ",0,{"$error":"#VALUE!"},"?"]
["P",{"$f":"IF(F29=\"\",\"\",9)","v":""},"∙",{"$f":"IF(F29=\"\",\"\",4)","v":""},"=",null,null,"",{"$error":"#VALUE!"},null,"",""," ∙ ",0,{"$error":"#VALUE!"},"?"]
["R",{"$f":"IF(F30=\"\",\"\",5)","v":""},"∙",{"$f":"IF(F30=\"\",\"\",6)","v":""},"=",null,null,"",{"$error":"#VALUE!"},null,"",""," ∙ ",0,{"$error":"#VALUE!"},"?"]
["S",{"$f":"IF(F31=\"\",\"\",10)","v":""},"∙",{"$f":"IF(F31=\"\",\"\",8)","v":""},"=",null,null,"",{"$error":"#VALUE!"},null,"",""," ∙ ",0,{"$error":"#VALUE!"},"?"]
["T",{"$f":"IF(F32=\"\",\"\",6)","v":""},"∙",{"$f":"IF(F32=\"\",\"\",5)","v":""},"=",null,null,"",{"$error":"#VALUE!"},null,"",""," ∙ ",0,{"$error":"#VALUE!"},"?"]
["U",{"$f":"IF(F33=\"\",\"\",10)","v":""},"∙",{"$f":"IF(F33=\"\",\"\",9)","v":""},"=",null,null,"",{"$error":"#VALUE!"},null,"",""," ∙ ",0,{"$error":"#VALUE!"},"?"]
[]
["HVALA ZA SODELOVANJE!"]

{"sheet":"Zbirnik po spolu","index":5,"n_rows":103,"n_cols":36,"rows_kept":103,"cut":false,"hidden":true,"merged":[[0,5,0,6],[0,7,0,8],[0,9,0,10],[0,11,0,12],[0,13,0,14],[1,16,1,18],[1,33,1,35],[0,22,0,23],[0,24,0,25],[0,26,0,27],[0,28,0,29],[0,30,0,31]]}
[null,null,null,null,null,201,null,202,null,203,null,204,null,205,null,null,null,null,null,null,null,null,201,null,202,null,203,null,204,null,205]
["a","b","a*b",null,null,"pravilnih","nepravilnih","pravilnih","nepravilnih","pravilnih","nepravilnih","pravilnih","nepravilnih","pravilnih","nepravilnih",null,"ŽENSKE",null,null,null,null,null,"pravilnih","nepravilnih","pravilnih","nepravilnih","pravilnih","nepravilnih","pravilnih","nepravilnih","pravilnih","nepravilnih",null,"MOŠKI"]
[1,1,{"$f":"A3*B3","v":1},null,{"$f":"(A3&\" ∙ \"&B3)","v":"1 ∙ 1"},{"$f":"IF('201'!$M$2=1,COUNTIFS('201'!$M:$M,E3,'201'!$P:$P,1),0)","v":0},{"$f":"IF('201'!$M$2=1,COUNTIFS('201'!$M:$M,E3,'201'!$P:$P,0),0)","v":0},{"$f":"IF('202'!$M$2=1,COUNTIFS('202'!$M:$M,E3,'202'!$P:$P,1),0)","v":0},{"$f":"IF('202'!$M$2=1,COUNTIFS('202'!$M:$M,E3,'202'!$P:$P,0),0)","v":0},{"$f":"IF('203'!$M$2=1,COUNTIFS('203'!$M:$M,E3,'203'!$P:$P,1),0)","v":0},{"$f":"IF('203'!$M$2=1,COUNTIFS('203'!$M:$M,E3,'203'!$P:$P,0),0)","v":0},{"$f":"IF('204'!$M$2=1,COUNTIFS('204'!$M:$M,E3,'204'!$P:$P,1),0)","v":0},{"$f":"IF('204'!$M$2=1,COUNTIFS('204'!$M:$M,E3,'204'!$P:$P,0),0)","v":0},{"$f":"IF('205'!$M$2=1,COUNTIFS('205'!$M:$M,E3,'205'!$P:$P,1),0)","v":0},{"$f":"IF('205'!$M$2=1,COUNTIFS('205'!$M:$M,E3,'205'!$P:$P,0),0)","v":0},null,{"$f":"SUM(F3:O3)","v":0},null,{"$f":"SUM(F3,H3,J3,L3,N3)/Q3","v":{"$error":"#DIV/0!"}},null,null,null,{"$f":"IF('201'!$M$2=2,COUNTIFS('201'!$M:$M,E3,'201'!$P:$P,1),0)","v":0},{"$f":"IF('201'!$M$2=2,COUNTIFS('201'!$M:$M,E3,'201'!$P:$P,0),0)","v":0},{"$f":"IF('202'!$M$2=2,COUNTIFS('202'!$M:$M,E3,'202'!$P:$P,1),0)","v":0},{"$f":"IF('202'!$M$2=2,COUNTIFS('202'!$M:$M,E3,'202'!$P:$P,0),0)","v":0},{"$f":"IF('203'!$M$2=2,COUNTIFS('203'!$M:$M,E3,'203'!$P:$P,1),0)","v":0},{"$f":"IF('203'!$M$2=2,COUNTIFS('203'!$M:$M,E3,'203'!$P:$P,0),0)","v":0},{"$f":"IF('204'!$M$2=2,COUNTIFS('204'!$M:$M,E3,'204'!$P:$P,1),0)","v":0},{"$f":"IF('204'!$M$2=2,COUNTIFS('204'!$M:$M,E3,'204'!$P:$P,0),0)","v":0},{"$f":"IF('205'!$M$2=2,COUNTIFS('205'!$M:$M,E3,'205'!$P:$P,1),0)","v":0},{"$f":"IF('205'!$M$2=2,COUNTIFS('205'!$M:$M,E3,'205'!$P:$P,0),0)","v":0},null,{"$f":"SUM(W3:AF3)","v":0},null,{"$f":"SUM(W3,Y3,AA3,AC3,AE3)/AH3","v":{"$error":"#DIV/0!"}}]
[2,1,{"$f":"A4*B4","v":2},null,{"$f":"(A4&\" ∙ \"&B4)","v":"2 ∙ 1"},{"$f":"IF('201'!$M$2=1,COUNTIFS('201'!$M:$M,E4,'201'!$P:$P,1),0)","v":0},{"$f":"IF('201'!$M$2=1,COUNTIFS('201'!$M:$M,E4,'201'!$P:$P,0),0)","v":0},{"$f":"IF('202'!$M$2=1,COUNTIFS('202'!$M:$M,E4,'202'!$P:$P,1),0)","v":0},{"$f":"IF('202'!$M$2=1,COUNTIFS('202'!$M:$M,E4,'202'!$P:$P,0),0)","v":0},{"$f":"IF('203'!$M$2=1,COUNTIFS('203'!$M:$M,E4,'203'!$P:$P,1),0)","v":0},{"$f":"IF('203'!$M$2=1,COUNTIFS('203'!$M:$M,E4,'203'!$P:$P,0),0)","v":0},{"$f":"IF('204'!$M$2=1,COUNTIFS('204'!$M:$M,E4,'204'!$P:$P,1),0)","v":0},{"$f":"IF('204'!$M$2=1,COUNTIFS('204'!$M:$M,E4,'204'!$P:$P,0),0)","v":0},{"$f":"IF('205'!$M$2=1,COUNTIFS('205'!$M:$M,E4,'205'!$P:$P,1),0)","v":0},{"$f":"IF('205'!$M$2=1,COUNTIFS('205'!$M:$M,E4,'205'!$P:$P,0),0)","v":0},null,0,null,{"$error":"#DIV/0!"},null,null,null,{"$f":"IF('201'!$M$2=2,COUNTIFS('201'!$M:$M,E4,'201'!$P:$P,1),0)","v":0},{"$f":"IF('201'!$M$2=2,COUNTIFS('201'!$M:$M,E4,'201'!$P:$P,0),0)","v":0},{"$f":"IF('202'!$M$2=2,COUNTIFS('202'!$M:$M,E4,'202'!$P:$P,1),0)","v":0},{"$f":"IF('202'!$M$2=2,COUNTIFS('202'!$M:$M,E4,'202'!$P:$P,0),0)","v":0},{"$f":"IF('203'!$M$2=2,COUNTIFS('203'!$M:$M,E4,'203'!$P:$P,1),0)","v":0},{"$f":"IF('203'!$M$2=2,COUNTIFS('203'!$M:$M,E4,'203'!$P:$P,0),0)","v":0},{"$f":"IF('204'!$M$2=2,COUNTIFS('204'!$M:$M,E4,'204'!$P:$P,1),0)","v":0},{"$f":"IF('204'!$M$2=2,COUNTIFS('204'!$M:$M,E4,'204'!$P:$P,0),0)","v":0},{"$f":"IF('205'!$M$2=2,COUNTIFS('205'!$M:$M,E4,'205'!$P:$P,1),0)","v":0},{"$f":"IF('205'!$M$2=2,COUNTIFS('205'!$M:$M,E4,'205'!$P:$P,0),0)","v":0},null,0,null,{"$error":"#DIV/0!"}]
[3,1,3,null,"3 ∙ 1",{"$f":"IF('201'!$M$2=1,COUNTIFS('201'!$M:$M,E5,'201'!$P:$P,1),0)","v":0},{"$f":"IF('201'!$M$2=1,COUNTIFS('201'!$M:$M,E5,'201'!$P:$P,0),0)","v":0},{"$f":"IF('202'!$M$2=1,COUNTIFS('202'!$M:$M,E5,'202'!$P:$P,1),0)","v":0},{"$f":"IF('202'!$M$2=1,COUNTIFS('202'!$M:$M,E5,'202'!$P:$P,0),0)","v":0},{"$f":"IF('203'!$M$2=1,COUNTIFS('203'!$M:$M,E5,'203'!$P:$P,1),0)","v":0},{"$f":"IF('203'!$M$2=1,COUNTIFS('203'!$M:$M,E5,'203'!$P:$P,0),0)","v":0},{"$f":"IF('204'!$M$2=1,COUNTIFS('204'!$M:$M,E5,'204'!$P:$P,1),0)","v":0},{"$f":"IF('204'!$M$2=1,COUNTIFS('204'!$M:$M,E5,'204'!$P:$P,0),0)","v":0},{"$f":"IF('205'!$M$2=1,COUNTIFS('205'!$M:$M,E5,'205'!$P:$P,1),0)","v":0},{"$f":"IF('205'!$M$2=1,COUNTIFS('205'!$M:$M,E5,'205'!$P:$P,0),0)","v":0},null,0,null,{"$error":"#DIV/0!"},null,null,null,{"$f":"IF('201'!$M$2=2,COUNTIFS('201'!$M:$M,E5,'201'!$P:$P,1),0)","v":0},{"$f":"IF('201'!$M$2=2,COUNTIFS('201'!$M:$M,E5,'201'!$P:$P,0),0)","v":0},{"$f":"IF('202'!$M$2=2,COUNTIFS('202'!$M:$M,E5,'202'!$P:$P,1),0)","v":0},{"$f":"IF('202'!$M$2=2,COUNTIFS('202'!$M:$M,E5,'202'!$P:$P,0),0)","v":0},{"$f":"IF('203'!$M$2=2,COUNTIFS('203'!$M:$M,E5,'203'!$P:$P,1),0)","v":0},{"$f":"IF('203'!$M$2=2,COUNTIFS('203'!$M:$M,E5,'203'!$P:$P,0),0)","v":0},{"$f":"IF('204'!$M$2=2,COUNTIFS('204'!$M:$M,E5,'204'!$P:$P,1),0)","v":0},{"$f":"IF('204'!$M$2=2,COUNTIFS('204'!$M:$M,E5,'204'!$P:$P,0),0)","v":0},{"$f":"IF('205'!$M$2=2,COUNTIFS('205'!$M:$M,E5,'205'!$P:$P,1),0)","v":0},{"$f":"IF('205'!$M$2=2,COUNTIFS('205'!$M:$M,E5,'205'!$P:$P,0),0)","v":0},null,0,null,{"$error":"#DIV/0!"}]
[4,1,4,null,"4 ∙ 1",{"$f":"IF('201'!$M$2=1,COUNTIFS('201'!$M:$M,E6,'201'!$P:$P,1),0)","v":0},{"$f":"IF('201'!$M$2=1,COUNTIFS('201'!$M:$M,E6,'201'!$P:$P,0),0)","v":0},{"$f":"IF('202'!$M$2=1,COUNTIFS('202'!$M:$M,E6,'202'!$P:$P,1),0)","v":0},{"$f":"IF('202'!$M$2=1,COUNTIFS('202'!$M:$M,E6,'202'!$P:$P,0),0)","v":0},{"$f":"IF('203'!$M$2=1,COUNTIFS('203'!$M:$M,E6,'203'!$P:$P,1),0)","v":0},{"$f":"IF('203'!$M$2=1,COUNTIFS('203'!$M:$M,E6,'203'!$P:$P,0),0)","v":0},{"$f":"IF('204'!$M$2=1,COUNTIFS('204'!$M:$M,E6,'204'!$P:$P,1),0)","v":0},{"$f":"IF('204'!$M$2=1,COUNTIFS('204'!$M:$M,E6,'204'!$P:$P,0),0)","v":0},{"$f":"IF('205'!$M$2=1,COUNTIFS('205'!$M:$M,E6,'205'!$P:$P,1),0)","v":0},{"$f":"IF('205'!$M$2=1,COUNTIFS('205'!$M:$M,E6,'205'!$P:$P,0),0)","v":0},null,0,null,{"$error":"#DIV/0!"},null,null,null,{"$f":"IF('201'!$M$2=2,COUNTIFS('201'!$M:$M,E6,'201'!$P:$P,1),0)","v":0},{"$f":"IF('201'!$M$2=2,COUNTIFS('201'!$M:$M,E6,'201'!$P:$P,0),0)","v":0},{"$f":"IF('202'!$M$2=2,COUNTIFS('202'!$M:$M,E6,'202'!$P:$P,1),0)","v":0},{"$f":"IF('202'!$M$2=2,COUNTIFS('202'!$M:$M,E6,'202'!$P:$P,0),0)","v":0},{"$f":"IF('203'!$M$2=2,COUNTIFS('203'!$M:$M,E6,'203'!$P:$P,1),0)","v":0},{"$f":"IF('203'!$M$2=2,COUNTIFS('203'!$M:$M,E6,'203'!$P:$P,0),0)","v":0},{"$f":"IF('204'!$M$2=2,COUNTIFS('204'!$M:$M,E6,'204'!$P:$P,1),0)","v":0},{"$f":"IF('204'!$M$2=2,COUNTIFS('204'!$M:$M,E6,'204'!$P:$P,0),0)","v":0},{"$f":"IF('205'!$M$2=2,COUNTIFS('205'!$M:$M,E6,'205'!$P:$P,1),0)","v":0},{"$f":"IF('205'!$M$2=2,COUNTIFS('205'!$M:$M,E6,'205'!$P:$P,0),0)","v":0},null,0,null,{"$error":"#DIV/0!"}]
[5,1,5,null,"5 ∙ 1",{"$f":"IF('201'!$M$2=1,COUNTIFS('201'!$M:$M,E7,'201'!$P:$P,1),0)","v":0},{"$f":"IF('201'!$M$2=1,COUNTIFS('201'!$M:$M,E7,'201'!$P:$P,0),0)","v":0},{"$f":"IF('202'!$M$2=1,COUNTIFS('202'!$M:$M,E7,'202'!$P:$P,1),0)","v":0},{"$f":"IF('202'!$M$2=1,COUNTIFS('202'!$M:$M,E7,'202'!$P:$P,0),0)","v":0},{"$f":"IF('203'!$M$2=1,COUNTIFS('203'!$M:$M,E7,'203'!$P:$P,1),0)","v":0},{"$f":"IF('203'!$M$2=1,COUNTIFS('203'!$M:$M,E7,'203'!$P:$P,0),0)","v":0},{"$f":"IF('204'!$M$2=1,COUNTIFS('204'!$M:$M,E7,'204'!$P:$P,1),0)","v":0},{"$f":"IF('204'!$M$2=1,COUNTIFS('204'!$M:$M,E7,'204'!$P:$P,0),0)","v":0},{"$f":"IF('205'!$M$2=1,COUNTIFS('205'!$M:$M,E7,'205'!$P:$P,1),0)","v":0},{"$f":"IF('205'!$M$2=1,COUNTIFS('205'!$M:$M,E7,'205'!$P:$P,0),0)","v":0},null,0,null,{"$error":"#DIV/0!"},null,null,null,{"$f":"IF('201'!$M$2=2,COUNTIFS('201'!$M:$M,E7,'201'!$P:$P,1),0)","v":0},{"$f":"IF('201'!$M$2=2,COUNTIFS('201'!$M:$M,E7,'201'!$P:$P,0),0)","v":0},{"$f":"IF('202'!$M$2=2,COUNTIFS('202'!$M:$M,E7,'202'!$P:$P,1),0)","v":0},{"$f":"IF('202'!$M$2=2,COUNTIFS('202'!$M:$M,E7,'202'!$P:$P,0),0)","v":0},{"$f":"IF('203'!$M$2=2,COUNTIFS('203'!$M:$M,E7,'203'!$P:$P,1),0)","v":0},{"$f":"IF('203'!$M$2=2,COUNTIFS('203'!$M:$M,E7,'203'!$P:$P,0),0)","v":0},{"$f":"IF('204'!$M$2=2,COUNTIFS('204'!$M:$M,E7,'204'!$P:$P,1),0)","v":0},{"$f":"IF('204'!$M$2=2,COUNTIFS('204'!$M:$M,E7,'204'!$P:$P,0),0)","v":0},{"$f":"IF('205'!$M$2=2,COUNTIFS('205'!$M:$M,E7,'205'!$P:$P,1),0)","v":0},{"$f":"IF('205'!$M$2=2,COUNTIFS('205'!$M:$M,E7,'205'!$P:$P,0),0)","v":0},null,0,null,{"$error":"#DIV/0!"}]
[6,1,6,null,"6 ∙ 1",{"$f":"IF('201'!$M$2=1,COUNTIFS('201'!$M:$M,E8,'201'!$P:$P,1),0)","v":0},{"$f":"IF('201'!$M$2=1,COUNTIFS('201'!$M:$M,E8,'201'!$P:$P,0),0)","v":0},{"$f":"IF('202'!$M$2=1,COUNTIFS('202'!$M:$M,E8,'202'!$P:$P,1),0)","v":0},{"$f":"IF('202'!$M$2=1,COUNTIFS('202'!$M:$M,E8,'202'!$P:$P,0),0)","v":0},{"$f":"IF('203'!$M$2=1,COUNTIFS('203'!$M:$M,E8,'203'!$P:$P,1),0)","v":0},{"$f":"IF('203'!$M$2=1,COUNTIFS('203'!$M:$M,E8,'203'!$P:$P,0),0)","v":0},{"$f":"IF('204'!$M$2=1,COUNTIFS('204'!$M:$M,E8,'204'!$P:$P,1),0)","v":0},{"$f":"IF('204'!$M$2=1,COUNTIFS('204'!$M:$M,E8,'204'!$P:$P,0),0)","v":0},{"$f":"IF('205'!$M$2=1,COUNTIFS('205'!$M:$M,E8,'205'!$P:$P,1),0)","v":0},{"$f":"IF('205'!$M$2=1,COUNTIFS('205'!$M:$M,E8,'205'!$P:$P,0),0)","v":0},null,0,null,{"$error":"#DIV/0!"},null,null,null,{"$f":"IF('201'!$M$2=2,COUNTIFS('201'!$M:$M,E8,'201'!$P:$P,1),0)","v":0},{"$f":"IF('201'!$M$2=2,COUNTIFS('201'!$M:$M,E8,'201'!$P:$P,0),0)","v":0},{"$f":"IF('202'!$M$2=2,COUNTIFS('202'!$M:$M,E8,'202'!$P:$P,1),0)","v":0},{"$f":"IF('202'!$M$2=2,COUNTIFS('202'!$M:$M,E8,'202'!$P:$P,0),0)","v":0},{"$f":"IF('203'!$M$2=2,COUNTIFS('203'!$M:$M,E8,'203'!$P:$P,1),0)","v":0},{"$f":"IF('203'!$M$2=2,COUNTIFS('203'!$M:$M,E8,'203'!$P:$P,0),0)","v":0},{"$f":"IF('204'!$M$2=2,COUNTIFS('204'!$M:$M,E8,'204'!$P:$P,1),0)","v":0},{"$f":"IF('204'!$M$2=2,COUNTIFS('204'!$M:$M,E8,'204'!$P:$P,0),0)","v":0},{"$f":"IF('205'!$M$2=2,COUNTIFS('205'!$M:$M,E8,'205'!$P:$P,1),0)","v":0},{"$f":"IF('205'!$M$2=2,COUNTIFS('205'!$M:$M,E8,'205'!$P:$P,0),0)","v":0},null,0,null,{"$error":"#DIV/0!"}]
[7,1,7,null,"7 ∙ 1",{"$f":"IF('201'!$M$2=1,COUNTIFS('201'!$M:$M,E9,'201'!$P:$P,1),0)","v":0},{"$f":"IF('201'!$M$2=1,COUNTIFS('201'!$M:$M,E9,'201'!$P:$P,0),0)","v":0},{"$f":"IF('202'!$M$2=1,COUNTIFS('202'!$M:$M,E9,'202'!$P:$P,1),0)","v":0},{"$f":"IF('202'!$M$2=1,COUNTIFS('202'!$M:$M,E9,'202'!$P:$P,0),0)","v":0},{"$f":"IF('203'!$M$2=1,COUNTIFS('203'!$M:$M,E9,'203'!$P:$P,1),0)","v":0},{"$f":"IF('203'!$M$2=1,COUNTIFS('203'!$M:$M,E9,'203'!$P:$P,0),0)","v":0},{"$f":"IF('204'!$M$2=1,COUNTIFS('204'!$M:$M,E9,'204'!$P:$P,1),0)","v":0},{"$f":"IF('204'!$M$2=1,COUNTIFS('204'!$M:$M,E9,'204'!$P:$P,0),0)","v":0},{"$f":"IF('205'!$M$2=1,COUNTIFS('205'!$M:$M,E9,'205'!$P:$P,1),0)","v":0},{"$f":"IF('205'!$M$2=1,COUNTIFS('205'!$M:$M,E9,'205'!$P:$P,0),0)","v":0},null,0,null,{"$error":"#DIV/0!"},null,null,null,{"$f":"IF('201'!$M$2=2,COUNTIFS('201'!$M:$M,E9,'201'!$P:$P,1),0)","v":0},{"$f":"IF('201'!$M$2=2,COUNTIFS('201'!$M:$M,E9,'201'!$P:$P,0),0)","v":0},{"$f":"IF('202'!$M$2=2,COUNTIFS('202'!$M:$M,E9,'202'!$P:$P,1),0)","v":0},{"$f":"IF('202'!$M$2=2,COUNTIFS('202'!$M:$M,E9,'202'!$P:$P,0),0)","v":0},{"$f":"IF('203'!$M$2=2,COUNTIFS('203'!$M:$M,E9,'203'!$P:$P,1),0)","v":0},{"$f":"IF('203'!$M$2=2,COUNTIFS('203'!$M:$M,E9,'203'!$P:$P,0),0)","v":0},{"$f":"IF('204'!$M$2=2,COUNTIFS('204'!$M:$M,E9,'204'!$P:$P,1),0)","v":0},{"$f":"IF('204'!$M$2=2,COUNTIFS('204'!$M:$M,E9,'204'!$P:$P,0),0)","v":0},{"$f":"IF('205'!$M$2=2,COUNTIFS('205'!$M:$M,E9,'205'!$P:$P,1),0)","v":0},{"$f":"IF('205'!$M$2=2,COUNTIFS('205'!$M:$M,E9,'205'!$P:$P,0),0)","v":0},null,0,null,{"$error":"#DIV/0!"}]
[8,1,8,null,"8 ∙ 1",{"$f":"IF('201'!$M$2=1,COUNTIFS('201'!$M:$M,E10,'201'!$P:$P,1),0)","v":0},{"$f":"IF('201'!$M$2=1,COUNTIFS('201'!$M:$M,E10,'201'!$P:$P,0),0)","v":0},{"$f":"IF('202'!$M$2=1,COUNTIFS('202'!$M:$M,E10,'202'!$P:$P,1),0)","v":0},{"$f":"IF('202'!$M$2=1,COUNTIFS('202'!$M:$M,E10,'202'!$P:$P,0),0)","v":0},{"$f":"IF('203'!$M$2=1,COUNTIFS('203'!$M:$M,E10,'203'!$P:$P,1),0)","v":0},{"$f":"IF('203'!$M$2=1,COUNTIFS('203'!$M:$M,E10,'203'!$P:$P,0),0)","v":0},{"$f":"IF('204'!$M$2=1,COUNTIFS('204'!$M:$M,E10,'204'!$P:$P,1),0)","v":0},{"$f":"IF('204'!$M$2=1,COUNTIFS('204'!$M:$M,E10,'204'!$P:$P,0),0)","v":0},{"$f":"IF('205'!$M$2=1,COUNTIFS('205'!$M:$M,E10,'205'!$P:$P,1),0)","v":0},{"$f":"IF('205'!$M$2=1,COUNTIFS('205'!$M:$M,E10,'205'!$P:$P,0),0)","v":0},null,0,null,{"$error":"#DIV/0!"},null,null,null,{"$f":"IF('201'!$M$2=2,COUNTIFS('201'!$M:$M,E10,'201'!$P:$P,1),0)","v":0},{"$f":"IF('201'!$M$2=2,COUNTIFS('201'!$M:$M,E10,'201'!$P:$P,0),0)","v":0},{"$f":"IF('202'!$M$2=2,COUNTIFS('202'!$M:$M,E10,'202'!$P:$P,1),0)","v":0},{"$f":"IF('202'!$M$2=2,COUNTIFS('202'!$M:$M,E10,'202'!$P:$P,0),0)","v":0},{"$f":"IF('203'!$M$2=2,COUNTIFS('203'!$M:$M,E10,'203'!$P:$P,1),0)","v":0},{"$f":"IF('203'!$M$2=2,COUNTIFS('203'!$M:$M,E10,'203'!$P:$P,0),0)","v":0},{"$f":"IF('204'!$M$2=2,COUNTIFS('204'!$M:$M,E10,'204'!$P:$P,1),0)","v":0},{"$f":"IF('204'!$M$2=2,COUNTIFS('204'!$M:$M,E10,'204'!$P:$P,0),0)","v":0},{"$f":"IF('205'!$M$2=2,COUNTIFS('205'!$M:$M,E10,'205'!$P:$P,1),0)","v":0},{"$f":"IF('205'!$M$2=2,COUNTIFS('205'!$M:$M,E10,'205'!$P:$P,0),0)","v":0},null,0,null,{"$error":"#DIV/0!"}]
[9,1,9,null,"9 ∙ 1",{"$f":"IF('201'!$M$2=1,COUNTIFS('201'!$M:$M,E11,'201'!$P:$P,1),0)","v":0},{"$f":"IF('201'!$M$2=1,COUNTIFS('201'!$M:$M,E11,'201'!$P:$P,0),0)","v":0},{"$f":"IF('202'!$M$2=1,COUNTIFS('202'!$M:$M,E11,'202'!$P:$P,1),0)","v":0},{"$f":"IF('202'!$M$2=1,COUNTIFS('202'!$M:$M,E11,'202'!$P:$P,0),0)","v":0},{"$f":"IF('203'!$M$2=1,COUNTIFS('203'!$M:$M,E11,'203'!$P:$P,1),0)","v":0},{"$f":"IF('203'!$M$2=1,COUNTIFS('203'!$M:$M,E11,'203'!$P:$P,0),0)","v":0},{"$f":"IF('204'!$M$2=1,COUNTIFS('204'!$M:$M,E11,'204'!$P:$P,1),0)","v":0},{"$f":"IF('204'!$M$2=1,COUNTIFS('204'!$M:$M,E11,'204'!$P:$P,0),0)","v":0},{"$f":"IF('205'!$M$2=1,COUNTIFS('205'!$M:$M,E11,'205'!$P:$P,1),0)","v":0},{"$f":"IF('205'!$M$2=1,COUNTIFS('205'!$M:$M,E11,'205'!$P:$P,0),0)","v":0},null,0,null,{"$error":"#DIV/0!"},null,null,null,{"$f":"IF('201'!$M$2=2,COUNTIFS('201'!$M:$M,E11,'201'!$P:$P,1),0)","v":0},{"$f":"IF('201'!$M$2=2,COUNTIFS('201'!$M:$M,E11,'201'!$P:$P,0),0)","v":0},{"$f":"IF('202'!$M$2=2,COUNTIFS('202'!$M:$M,E11,'202'!$P:$P,1),0)","v":0},{"$f":"IF('202'!$M$2=2,COUNTIFS('202'!$M:$M,E11,'202'!$P:$P,0),0)","v":0},{"$f":"IF('203'!$M$2=2,COUNTIFS('203'!$M:$M,E11,'203'!$P:$P,1),0)","v":0},{"$f":"IF('203'!$M$2=2,COUNTIFS('203'!$M:$M,E11,'203'!$P:$P,0),0)","v":0},{"$f":"IF('204'!$M$2=2,COUNTIFS('204'!$M:$M,E11,'204'!$P:$P,1),0)","v":0},{"$f":"IF('204'!$M$2=2,COUNTIFS('204'!$M:$M,E11,'204'!$P:$P,0),0)","v":0},{"$f":"IF('205'!$M$2=2,COUNTIFS('205'!$M:$M,E11,'205'!$P:$P,1),0)","v":0},{"$f":"IF('205'!$M$2=2,COUNTIFS('205'!$M:$M,E11,'205'!$P:$P,0),0)","v":0},null,0,null,{"$error":"#DIV/0!"}]
[10,1,10,null,"10 ∙ 1",{"$f":"IF('201'!$M$2=1,COUNTIFS('201'!$M:$M,E12,'201'!$P:$P,1),0)","v":0},{"$f":"IF('201'!$M$2=1,COUNTIFS('201'!$M:$M,E12,'201'!$P:$P,0),0)","v":0},{"$f":"IF('202'!$M$2=1,COUNTIFS('202'!$M:$M,E12,'202'!$P:$P,1),0)","v":0},{"$f":"IF('202'!$M$2=1,COUNTIFS('202'!$M:$M,E12,'202'!$P:$P,0),0)","v":0},{"$f":"IF('203'!$M$2=1,COUNTIFS('203'!$M:$M,E12,'203'!$P:$P,1),0)","v":0},{"$f":"IF('203'!$M$2=1,COUNTIFS('203'!$M:$M,E12,'203'!$P:$P,0),0)","v":0},{"$f":"IF('204'!$M$2=1,COUNTIFS('204'!$M:$M,E12,'204'!$P:$P,1),0)","v":0},{"$f":"IF('204'!$M$2=1,COUNTIFS('204'!$M:$M,E12,'204'!$P:$P,0),0)","v":0},{"$f":"IF('205'!$M$2=1,COUNTIFS('205'!$M:$M,E12,'205'!$P:$P,1),0)","v":0},{"$f":"IF('205'!$M$2=1,COUNTIFS('205'!$M:$M,E12,'205'!$P:$P,0),0)","v":0},null,0,null,{"$error":"#DIV/0!"},null,null,null,{"$f":"IF('201'!$M$2=2,COUNTIFS('201'!$M:$M,E12,'201'!$P:$P,1),0)","v":0},{"$f":"IF('201'!$M$2=2,COUNTIFS('201'!$M:$M,E12,'201'!$P:$P,0),0)","v":0},{"$f":"IF('202'!$M$2=2,COUNTIFS('202'!$M:$M,E12,'202'!$P:$P,1),0)","v":0},{"$f":"IF('202'!$M$2=2,COUNTIFS('202'!$M:$M,E12,'202'!$P:$P,0),0)","v":0},{"$f":"IF('203'!$M$2=2,COUNTIFS('203'!$M:$M,E12,'203'!$P:$P,1),0)","v":0},{"$f":"IF('203'!$M$2=2,COUNTIFS('203'!$M:$M,E12,'203'!$P:$P,0),0)","v":0},{"$f":"IF('204'!$M$2=2,COUNTIFS('204'!$M:$M,E12,'204'!$P:$P,1),0)","v":0},{"$f":"IF('204'!$M$2=2,COUNTIFS('204'!$M:$M,E12,'204'!$P:$P,0),0)","v":0},{"$f":"IF('205'!$M$2=2,COUNTIFS('205'!$M:$M,E12,'205'!$P:$P,1),0)","v":0},{"$f":"IF('205'!$M$2=2,COUNTIFS('205'!$M:$M,E12,'205'!$P:$P,0),0)","v":0},null,0,null,{"$error":"#DIV/0!"}]
[1,2,2,null,"1 ∙ 2",{"$f":"IF('201'!$M$2=1,COUNTIFS('201'!$M:$M,E13,'201'!$P:$P,1),0)","v":0},{"$f":"IF('201'!$M$2=1,COUNTIFS('201'!$M:$M,E13,'201'!$P:$P,0),0)","v":0},{"$f":"IF('202'!$M$2=1,COUNTIFS('202'!$M:$M,E13,'202'!$P:$P,1),0)","v":0},{"$f":"IF('202'!$M$2=1,COUNTIFS('202'!$M:$M,E13,'202'!$P:$P,0),0)","v":0},{"$f":"IF('203'!$M$2=1,COUNTIFS('203'!$M:$M,E13,'203'!$P:$P,1),0)","v":0},{"$f":"IF('203'!$M$2=1,COUNTIFS('203'!$M:$M,E13,'203'!$P:$P,0),0)","v":0},{"$f":"IF('204'!$M$2=1,COUNTIFS('204'!$M:$M,E13,'204'!$P:$P,1),0)","v":0},{"$f":"IF('204'!$M$2=1,COUNTIFS('204'!$M:$M,E13,'204'!$P:$P,0),0)","v":0},{"$f":"IF('205'!$M$2=1,COUNTIFS('205'!$M:$M,E13,'205'!$P:$P,1),0)","v":0},{"$f":"IF('205'!$M$2=1,COUNTIFS('205'!$M:$M,E13,'205'!$P:$P,0),0)","v":0},null,0,null,{"$error":"#DIV/0!"},null,null,null,{"$f":"IF('201'!$M$2=2,COUNTIFS('201'!$M:$M,E13,'201'!$P:$P,1),0)","v":0},{"$f":"IF('201'!$M$2=2,COUNTIFS('201'!$M:$M,E13,'201'!$P:$P,0),0)","v":0},{"$f":"IF('202'!$M$2=2,COUNTIFS('202'!$M:$M,E13,'202'!$P:$P,1),0)","v":0},{"$f":"IF('202'!$M$2=2,COUNTIFS('202'!$M:$M,E13,'202'!$P:$P,0),0)","v":0},{"$f":"IF('203'!$M$2=2,COUNTIFS('203'!$M:$M,E13,'203'!$P:$P,1),0)","v":0},{"$f":"IF('203'!$M$2=2,COUNTIFS('203'!$M:$M,E13,'203'!$P:$P,0),0)","v":0},{"$f":"IF('204'!$M$2=2,COUNTIFS('204'!$M:$M,E13,'204'!$P:$P,1),0)","v":0},{"$f":"IF('204'!$M$2=2,COUNTIFS('204'!$M:$M,E13,'204'!$P:$P,0),0)","v":0},{"$f":"IF('205'!$M$2=2,COUNTIFS('205'!$M:$M,E13,'205'!$P:$P,1),0)","v":0},{"$f":"IF('205'!$M$2=2,COUNTIFS('205'!$M:$M,E13,'205'!$P:$P,0),0)","v":0},null,0,null,{"$error":"#DIV/0!"}]
[2,2,4,null,"2 ∙ 2",{"$f":"IF('201'!$M$2=1,COUNTIFS('201'!$M:$M,E14,'201'!$P:$P,1),0)","v":0},{"$f":"IF('201'!$M$2=1,COUNTIFS('201'!$M:$M,E14,'201'!$P:$P,0),0)","v":0},{"$f":"IF('202'!$M$2=1,COUNTIFS('202'!$M:$M,E14,'202'!$P:$P,1),0)","v":0},{"$f":"IF('202'!$M$2=1,COUNTIFS('202'!$M:$M,E14,'202'!$P:$P,0),0)","v":0},{"$f":"IF('203'!$M$2=1,COUNTIFS('203'!$M:$M,E14,'203'!$P:$P,1),0)","v":0},{"$f":"IF('203'!$M$2=1,COUNTIFS('203'!$M:$M,E14,'203'!$P:$P,0),0)","v":0},{"$f":"IF('204'!$M$2=1,COUNTIFS('204'!$M:$M,E14,'204'!$P:$P,1),0)","v":0},{"$f":"IF('204'!$M$2=1,COUNTIFS('204'!$M:$M,E14,'204'!$P:$P,0),0)","v":0},{"$f":"IF('205'!$M$2=1,COUNTIFS('205'!$M:$M,E14,'205'!$P:$P,1),0)","v":0},{"$f":"IF('205'!$M$2=1,COUNTIFS('205'!$M:$M,E14,'205'!$P:$P,0),0)","v":0},null,0,null,{"$error":"#DIV/0!"},null,null,null,{"$f":"IF('201'!$M$2=2,COUNTIFS('201'!$M:$M,E14,'201'!$P:$P,1),0)","v":0},{"$f":"IF('201'!$M$2=2,COUNTIFS('201'!$M:$M,E14,'201'!$P:$P,0),0)","v":0},{"$f":"IF('202'!$M$2=2,COUNTIFS('202'!$M:$M,E14,'202'!$P:$P,1),0)","v":0},{"$f":"IF('202'!$M$2=2,COUNTIFS('202'!$M:$M,E14,'202'!$P:$P,0),0)","v":0},{"$f":"IF('203'!$M$2=2,COUNTIFS('203'!$M:$M,E14,'203'!$P:$P,1),0)","v":0},{"$f":"IF('203'!$M$2=2,COUNTIFS('203'!$M:$M,E14,'203'!$P:$P,0),0)","v":0},{"$f":"IF('204'!$M$2=2,COUNTIFS('204'!$M:$M,E14,'204'!$P:$P,1),0)","v":0},{"$f":"IF('204'!$M$2=2,COUNTIFS('204'!$M:$M,E14,'204'!$P:$P,0),0)","v":0},{"$f":"IF('205'!$M$2=2,COUNTIFS('205'!$M:$M,E14,'205'!$P:$P,1),0)","v":0},{"$f":"IF('205'!$M$2=2,COUNTIFS('205'!$M:$M,E14,'205'!$P:$P,0),0)","v":0},null,0,null,{"$error":"#DIV/0!"}]
[3,2,6,null,"3 ∙ 2",{"$f":"IF('201'!$M$2=1,COUNTIFS('201'!$M:$M,E15,'201'!$P:$P,1),0)","v":0},{"$f":"IF('201'!$M$2=1,COUNTIFS('201'!$M:$M,E15,'201'!$P:$P,0),0)","v":0},{"$f":"IF('202'!$M$2=1,COUNTIFS('202'!$M:$M,E15,'202'!$P:$P,1),0)","v":0},{"$f":"IF('202'!$M$2=1,COUNTIFS('202'!$M:$M,E15,'202'!$P:$P,0),0)","v":0},{"$f":"IF('203'!$M$2=1,COUNTIFS('203'!$M:$M,E15,'203'!$P:$P,1),0)","v":0},{"$f":"IF('203'!$M$2=1,COUNTIFS('203'!$M:$M,E15,'203'!$P:$P,0),0)","v":0},{"$f":"IF('204'!$M$2=1,COUNTIFS('204'!$M:$M,E15,'204'!$P:$P,1),0)","v":0},{"$f":"IF('204'!$M$2=1,COUNTIFS('204'!$M:$M,E15,'204'!$P:$P,0),0)","v":0},{"$f":"IF('205'!$M$2=1,COUNTIFS('205'!$M:$M,E15,'205'!$P:$P,1),0)","v":0},{"$f":"IF('205'!$M$2=1,COUNTIFS('205'!$M:$M,E15,'205'!$P:$P,0),0)","v":0},null,0,null,{"$error":"#DIV/0!"},null,null,null,{"$f":"IF('201'!$M$2=2,COUNTIFS('201'!$M:$M,E15,'201'!$P:$P,1),0)","v":0},{"$f":"IF('201'!$M$2=2,COUNTIFS('201'!$M:$M,E15,'201'!$P:$P,0),0)","v":0},{"$f":"IF('202'!$M$2=2,COUNTIFS('202'!$M:$M,E15,'202'!$P:$P,1),0)","v":0},{"$f":"IF('202'!$M$2=2,COUNTIFS('202'!$M:$M,E15,'202'!$P:$P,0),0)","v":0},{"$f":"IF('203'!$M$2=2,COUNTIFS('203'!$M:$M,E15,'203'!$P:$P,1),0)","v":0},{"$f":"IF('203'!$M$2=2,COUNTIFS('203'!$M:$M,E15,'203'!$P:$P,0),0)","v":0},{"$f":"IF('204'!$M$2=2,COUNTIFS('204'!$M:$M,E15,'204'!$P:$P,1),0)","v":0},{"$f":"IF('204'!$M$2=2,COUNTIFS('204'!$M:$M,E15,'204'!$P:$P,0),0)","v":0},{"$f":"IF('205'!$M$2=2,COUNTIFS('205'!$M:$M,E15,'205'!$P:$P,1),0)","v":0},{"$f":"IF('205'!$M$2=2,COUNTIFS('205'!$M:$M,E15,'205'!$P:$P,0),0)","v":0},null,0,null,{"$error":"#DIV/0!"}]
[4,2,8,null,"4 ∙ 2",{"$f":"IF('201'!$M$2=1,COUNTIFS('201'!$M:$M,E16,'201'!$P:$P,1),0)","v":0},{"$f":"IF('201'!$M$2=1,COUNTIFS('201'!$M:$M,E16,'201'!$P:$P,0),0)","v":0},{"$f":"IF('202'!$M$2=1,COUNTIFS('202'!$M:$M,E16,'202'!$P:$P,1),0)","v":0},{"$f":"IF('202'!$M$2=1,COUNTIFS('202'!$M:$M,E16,'202'!$P:$P,0),0)","v":0},{"$f":"IF('203'!$M$2=1,COUNTIFS('203'!$M:$M,E16,'203'!$P:$P,1),0)","v":0},{"$f":"IF('203'!$M$2=1,COUNTIFS('203'!$M:$M,E16,'203'!$P:$P,0),0)","v":0},{"$f":"IF('204'!$M$2=1,COUNTIFS('204'!$M:$M,E16,'204'!$P:$P,1),0)","v":0},{"$f":"IF('204'!$M$2=1,COUNTIFS('204'!$M:$M,E16,'204'!$P:$P,0),0)","v":0},{"$f":"IF('205'!$M$2=1,COUNTIFS('205'!$M:$M,E16,'205'!$P:$P,1),0)","v":0},{"$f":"IF('205'!$M$2=1,COUNTIFS('205'!$M:$M,E16,'205'!$P:$P,0),0)","v":0},null,0,null,{"$error":"#DIV/0!"},null,null,null,{"$f":"IF('201'!$M$2=2,COUNTIFS('201'!$M:$M,E16,'201'!$P:$P,1),0)","v":0},{"$f":"IF('201'!$M$2=2,COUNTIFS('201'!$M:$M,E16,'201'!$P:$P,0),0)","v":0},{"$f":"IF('202'!$M$2=2,COUNTIFS('202'!$M:$M,E16,'202'!$P:$P,1),0)","v":0},{"$f":"IF('202'!$M$2=2,COUNTIFS('202'!$M:$M,E16,'202'!$P:$P,0),0)","v":0},{"$f":"IF('203'!$M$2=2,COUNTIFS('203'!$M:$M,E16,'203'!$P:$P,1),0)","v":0},{"$f":"IF('203'!$M$2=2,COUNTIFS('203'!$M:$M,E16,'203'!$P:$P,0),0)","v":0},{"$f":"IF('204'!$M$2=2,COUNTIFS('204'!$M:$M,E16,'204'!$P:$P,1),0)","v":0},{"$f":"IF('204'!$M$2=2,COUNTIFS('204'!$M:$M,E16,'204'!$P:$P,0),0)","v":0},{"$f":"IF('205'!$M$2=2,COUNTIFS('205'!$M:$M,E16,'205'!$P:$P,1),0)","v":0},{"$f":"IF('205'!$M$2=2,COUNTIFS('205'!$M:$M,E16,'205'!$P:$P,0),0)","v":0},null,0,null,{"$error":"#DIV/0!"}]
[5,2,10,null,"5 ∙ 2",{"$f":"IF('201'!$M$2=1,COUNTIFS('201'!$M:$M,E17,'201'!$P:$P,1),0)","v":0},{"$f":"IF('201'!$M$2=1,COUNTIFS('201'!$M:$M,E17,'201'!$P:$P,0),0)","v":0},{"$f":"IF('202'!$M$2=1,COUNTIFS('202'!$M:$M,E17,'202'!$P:$P,1),0)","v":0},{"$f":"IF('202'!$M$2=1,COUNTIFS('202'!$M:$M,E17,'202'!$P:$P,0),0)","v":0},{"$f":"IF('203'!$M$2=1,COUNTIFS('203'!$M:$M,E17,'203'!$P:$P,1),0)","v":0},{"$f":"IF('203'!$M$2=1,COUNTIFS('203'!$M:$M,E17,'203'!$P:$P,0),0)","v":0},{"$f":"IF('204'!$M$2=1,COUNTIFS('204'!$M:$M,E17,'204'!$P:$P,1),0)","v":0},{"$f":"IF('204'!$M$2=1,COUNTIFS('204'!$M:$M,E17,'204'!$P:$P,0),0)","v":0},{"$f":"IF('205'!$M$2=1,COUNTIFS('205'!$M:$M,E17,'205'!$P:$P,1),0)","v":0},{"$f":"IF('205'!$M$2=1,COUNTIFS('205'!$M:$M,E17,'205'!$P:$P,0),0)","v":0},null,0,null,{"$error":"#DIV/0!"},null,null,null,{"$f":"IF('201'!$M$2=2,COUNTIFS('201'!$M:$M,E17,'201'!$P:$P,1),0)","v":0},{"$f":"IF('201'!$M$2=2,COUNTIFS('201'!$M:$M,E17,'201'!$P:$P,0),0)","v":0},{"$f":"IF('202'!$M$2=2,COUNTIFS('202'!$M:$M,E17,'202'!$P:$P,1),0)","v":0},{"$f":"IF('202'!$M$2=2,COUNTIFS('202'!$M:$M,E17,'202'!$P:$P,0),0)","v":0},{"$f":"IF('203'!$M$2=2,COUNTIFS('203'!$M:$M,E17,'203'!$P:$P,1),0)","v":0},{"$f":"IF('203'!$M$2=2,COUNTIFS('203'!$M:$M,E17,'203'!$P:$P,0),0)","v":0},{"$f":"IF('204'!$M$2=2,COUNTIFS('204'!$M:$M,E17,'204'!$P:$P,1),0)","v":0},{"$f":"IF('204'!$M$2=2,COUNTIFS('204'!$M:$M,E17,'204'!$P:$P,0),0)","v":0},{"$f":"IF('205'!$M$2=2,COUNTIFS('205'!$M:$M,E17,'205'!$P:$P,1),0)","v":0},{"$f":"IF('205'!$M$2=2,COUNTIFS('205'!$M:$M,E17,'205'!$P:$P,0),0)","v":0},null,0,null,{"$error":"#DIV/0!"}]
[6,2,12,null,"6 ∙ 2",{"$f":"IF('201'!$M$2=1,COUNTIFS('201'!$M:$M,E18,'201'!$P:$P,1),0)","v":0},{"$f":"IF('201'!$M$2=1,COUNTIFS('201'!$M:$M,E18,'201'!$P:$P,0),0)","v":0},{"$f":"IF('202'!$M$2=1,COUNTIFS('202'!$M:$M,E18,'202'!$P:$P,1),0)","v":0},{"$f":"IF('202'!$M$2=1,COUNTIFS('202'!$M:$M,E18,'202'!$P:$P,0),0)","v":0},{"$f":"IF('203'!$M$2=1,COUNTIFS('203'!$M:$M,E18,'203'!$P:$P,1),0)","v":0},{"$f":"IF('203'!$M$2=1,COUNTIFS('203'!$M:$M,E18,'203'!$P:$P,0),0)","v":0},{"$f":"IF('204'!$M$2=1,COUNTIFS('204'!$M:$M,E18,'204'!$P:$P,1),0)","v":0},{"$f":"IF('204'!$M$2=1,COUNTIFS('204'!$M:$M,E18,'204'!$P:$P,0),0)","v":0},{"$f":"IF('205'!$M$2=1,COUNTIFS('205'!$M:$M,E18,'205'!$P:$P,1),0)","v":0},{"$f":"IF('205'!$M$2=1,COUNTIFS('205'!$M:$M,E18,'205'!$P:$P,0),0)","v":0},null,0,null,{"$error":"#DIV/0!"},null,null,null,{"$f":"IF('201'!$M$2=2,COUNTIFS('201'!$M:$M,E18,'201'!$P:$P,1),0)","v":0},{"$f":"IF('201'!$M$2=2,COUNTIFS('201'!$M:$M,E18,'201'!$P:$P,0),0)","v":0},{"$f":"IF('202'!$M$2=2,COUNTIFS('202'!$M:$M,E18,'202'!$P:$P,1),0)","v":0},{"$f":"IF('202'!$M$2=2,COUNTIFS('202'!$M:$M,E18,'202'!$P:$P,0),0)","v":0},{"$f":"IF('203'!$M$2=2,COUNTIFS('203'!$M:$M,E18,'203'!$P:$P,1),0)","v":0},{"$f":"IF('203'!$M$2=2,COUNTIFS('203'!$M:$M,E18,'203'!$P:$P,0),0)","v":0},{"$f":"IF('204'!$M$2=2,COUNTIFS('204'!$M:$M,E18,'204'!$P:$P,1),0)","v":0},{"$f":"IF('204'!$M$2=2,COUNTIFS('204'!$M:$M,E18,'204'!$P:$P,0),0)","v":0},{"$f":"IF('205'!$M$2=2,COUNTIFS('205'!$M:$M,E18,'205'!$P:$P,1),0)","v":0},{"$f":"IF('205'!$M$2=2,COUNTIFS('205'!$M:$M,E18,'205'!$P:$P,0),0)","v":0},null,0,null,{"$error":"#DIV/0!"}]
[7,2,14,null,"7 ∙ 2",{"$f":"IF('201'!$M$2=1,COUNTIFS('201'!$M:$M,E19,'201'!$P:$P,1),0)","v":0},{"$f":"IF('201'!$M$2=1,COUNTIFS('201'!$M:$M,E19,'201'!$P:$P,0),0)","v":0},{"$f":"IF('202'!$M$2=1,COUNTIFS('202'!$M:$M,E19,'202'!$P:$P,1),0)","v":0},{"$f":"IF('202'!$M$2=1,COUNTIFS('202'!$M:$M,E19,'202'!$P:$P,0),0)","v":0},{"$f":"IF('203'!$M$2=1,COUNTIFS('203'!$M:$M,E19,'203'!$P:$P,1),0)","v":0},{"$f":"IF('203'!$M$2=1,COUNTIFS('203'!$M:$M,E19,'203'!$P:$P,0),0)","v":0},{"$f":"IF('204'!$M$2=1,COUNTIFS('204'!$M:$M,E19,'204'!$P:$P,1),0)","v":0},{"$f":"IF('204'!$M$2=1,COUNTIFS('204'!$M:$M,E19,'204'!$P:$P,0),0)","v":0},{"$f":"IF('205'!$M$2=1,COUNTIFS('205'!$M:$M,E19,'205'!$P:$P,1),0)","v":0},{"$f":"IF('205'!$M$2=1,COUNTIFS('205'!$M:$M,E19,'205'!$P:$P,0),0)","v":0},null,0,null,{"$error":"#DIV/0!"},null,null,null,{"$f":"IF('201'!$M$2=2,COUNTIFS('201'!$M:$M,E19,'201'!$P:$P,1),0)","v":0},{"$f":"IF('201'!$M$2=2,COUNTIFS('201'!$M:$M,E19,'201'!$P:$P,0),0)","v":0},{"$f":"IF('202'!$M$2=2,COUNTIFS('202'!$M:$M,E19,'202'!$P:$P,1),0)","v":0},{"$f":"IF('202'!$M$2=2,COUNTIFS('202'!$M:$M,E19,'202'!$P:$P,0),0)","v":0},{"$f":"IF('203'!$M$2=2,COUNTIFS('203'!$M:$M,E19,'203'!$P:$P,1),0)","v":0},{"$f":"IF('203'!$M$2=2,COUNTIFS('203'!$M:$M,E19,'203'!$P:$P,0),0)","v":0},{"$f":"IF('204'!$M$2=2,COUNTIFS('204'!$M:$M,E19,'204'!$P:$P,1),0)","v":0},{"$f":"IF('204'!$M$2=2,COUNTIFS('204'!$M:$M,E19,'204'!$P:$P,0),0)","v":0},{"$f":"IF('205'!$M$2=2,COUNTIFS('205'!$M:$M,E19,'205'!$P:$P,1),0)","v":0},{"$f":"IF('205'!$M$2=2,COUNTIFS('205'!$M:$M,E19,'205'!$P:$P,0),0)","v":0},null,0,null,{"$error":"#DIV/0!"}]
[8,2,16,null,"8 ∙ 2",{"$f":"IF('201'!$M$2=1,COUNTIFS('201'!$M:$M,E20,'201'!$P:$P,1),0)","v":0},{"$f":"IF('201'!$M$2=1,COUNTIFS('201'!$M:$M,E20,'201'!$P:$P,0),0)","v":0},{"$f":"IF('202'!$M$2=1,COUNTIFS('202'!$M:$M,E20,'202'!$P:$P,1),0)","v":0},{"$f":"IF('202'!$M$2=1,COUNTIFS('202'!$M:$M,E20,'202'!$P:$P,0),0)","v":0},{"$f":"IF('203'!$M$2=1,COUNTIFS('203'!$M:$M,E20,'203'!$P:$P,1),0)","v":0},{"$f":"IF('203'!$M$2=1,COUNTIFS('203'!$M:$M,E20,'203'!$P:$P,0),0)","v":0},{"$f":"IF('204'!$M$2=1,COUNTIFS('204'!$M:$M,E20,'204'!$P:$P,1),0)","v":0},{"$f":"IF('204'!$M$2=1,COUNTIFS('204'!$M:$M,E20,'204'!$P:$P,0),0)","v":0},{"$f":"IF('205'!$M$2=1,COUNTIFS('205'!$M:$M,E20,'205'!$P:$P,1),0)","v":0},{"$f":"IF('205'!$M$2=1,COUNTIFS('205'!$M:$M,E20,'205'!$P:$P,0),0)","v":0},null,0,null,{"$error":"#DIV/0!"},null,null,null,{"$f":"IF('201'!$M$2=2,COUNTIFS('201'!$M:$M,E20,'201'!$P:$P,1),0)","v":0},{"$f":"IF('201'!$M$2=2,COUNTIFS('201'!$M:$M,E20,'201'!$P:$P,0),0)","v":0},{"$f":"IF('202'!$M$2=2,COUNTIFS('202'!$M:$M,E20,'202'!$P:$P,1),0)","v":0},{"$f":"IF('202'!$M$2=2,COUNTIFS('202'!$M:$M,E20,'202'!$P:$P,0),0)","v":0},{"$f":"IF('203'!$M$2=2,COUNTIFS('203'!$M:$M,E20,'203'!$P:$P,1),0)","v":0},{"$f":"IF('203'!$M$2=2,COUNTIFS('203'!$M:$M,E20,'203'!$P:$P,0),0)","v":0},{"$f":"IF('204'!$M$2=2,COUNTIFS('204'!$M:$M,E20,'204'!$P:$P,1),0)","v":0},{"$f":"IF('204'!$M$2=2,COUNTIFS('204'!$M:$M,E20,'204'!$P:$P,0),0)","v":0},{"$f":"IF('205'!$M$2=2,COUNTIFS('205'!$M:$M,E20,'205'!$P:$P,1),0)","v":0},{"$f":"IF('205'!$M$2=2,COUNTIFS('205'!$M:$M,E20,'205'!$P:$P,0),0)","v":0},null,0,null,{"$error":"#DIV/0!"}]
[9,2,18,null,"9 ∙ 2",{"$f":"IF('201'!$M$2=1,COUNTIFS('201'!$M:$M,E21,'201'!$P:$P,1),0)","v":0},{"$f":"IF('201'!$M$2=1,COUNTIFS('201'!$M:$M,E21,'201'!$P:$P,0),0)","v":0},{"$f":"IF('202'!$M$2=1,COUNTIFS('202'!$M:$M,E21,'202'!$P:$P,1),0)","v":0},{"$f":"IF('202'!$M$2=1,COUNTIFS('202'!$M:$M,E21,'202'!$P:$P,0),0)","v":0},{"$f":"IF('203'!$M$2=1,COUNTIFS('203'!$M:$M,E21,'203'!$P:$P,1),0)","v":0},{"$f":"IF('203'!$M$2=1,COUNTIFS('203'!$M:$M,E21,'203'!$P:$P,0),0)","v":0},{"$f":"IF('204'!$M$2=1,COUNTIFS('204'!$M:$M,E21,'204'!$P:$P,1),0)","v":0},{"$f":"IF('204'!$M$2=1,COUNTIFS('204'!$M:$M,E21,'204'!$P:$P,0),0)","v":0},{"$f":"IF('205'!$M$2=1,COUNTIFS('205'!$M:$M,E21,'205'!$P:$P,1),0)","v":0},{"$f":"IF('205'!$M$2=1,COUNTIFS('205'!$M:$M,E21,'205'!$P:$P,0),0)","v":0},null,0,null,{"$error":"#DIV/0!"},null,null,null,{"$f":"IF('201'!$M$2=2,COUNTIFS('201'!$M:$M,E21,'201'!$P:$P,1),0)","v":0},{"$f":"IF('201'!$M$2=2,COUNTIFS('201'!$M:$M,E21,'201'!$P:$P,0),0)","v":0},{"$f":"IF('202'!$M$2=2,COUNTIFS('202'!$M:$M,E21,'202'!$P:$P,1),0)","v":0},{"$f":"IF('202'!$M$2=2,COUNTIFS('202'!$M:$M,E21,'202'!$P:$P,0),0)","v":0},{"$f":"IF('203'!$M$2=2,COUNTIFS('203'!$M:$M,E21,'203'!$P:$P,1),0)","v":0},{"$f":"IF('203'!$M$2=2,COUNTIFS('203'!$M:$M,E21,'203'!$P:$P,0),0)","v":0},{"$f":"IF('204'!$M$2=2,COUNTIFS('204'!$M:$M,E21,'204'!$P:$P,1),0)","v":0},{"$f":"IF('204'!$M$2=2,COUNTIFS('204'!$M:$M,E21,'204'!$P:$P,0),0)","v":0},{"$f":"IF('205'!$M$2=2,COUNTIFS('205'!$M:$M,E21,'205'!$P:$P,1),0)","v":0},{"$f":"IF('205'!$M$2=2,COUNTIFS('205'!$M:$M,E21,'205'!$P:$P,0),0)","v":0},null,0,null,{"$error":"#DIV/0!"}]
[10,2,20,null,"10 ∙ 2",{"$f":"IF('201'!$M$2=1,COUNTIFS('201'!$M:$M,E22,'201'!$P:$P,1),0)","v":0},{"$f":"IF('201'!$M$2=1,COUNTIFS('201'!$M:$M,E22,'201'!$P:$P,0),0)","v":0},{"$f":"IF('202'!$M$2=1,COUNTIFS('202'!$M:$M,E22,'202'!$P:$P,1),0)","v":0},{"$f":"IF('202'!$M$2=1,COUNTIFS('202'!$M:$M,E22,'202'!$P:$P,0),0)","v":0},{"$f":"IF('203'!$M$2=1,COUNTIFS('203'!$M:$M,E22,'203'!$P:$P,1),0)","v":0},{"$f":"IF('203'!$M$2=1,COUNTIFS('203'!$M:$M,E22,'203'!$P:$P,0),0)","v":0},{"$f":"IF('204'!$M$2=1,COUNTIFS('204'!$M:$M,E22,'204'!$P:$P,1),0)","v":0},{"$f":"IF('204'!$M$2=1,COUNTIFS('204'!$M:$M,E22,'204'!$P:$P,0),0)","v":0},{"$f":"IF('205'!$M$2=1,COUNTIFS('205'!$M:$M,E22,'205'!$P:$P,1),0)","v":0},{"$f":"IF('205'!$M$2=1,COUNTIFS('205'!$M:$M,E22,'205'!$P:$P,0),0)","v":0},null,0,null,{"$error":"#DIV/0!"},null,null,null,{"$f":"IF('201'!$M$2=2,COUNTIFS('201'!$M:$M,E22,'201'!$P:$P,1),0)","v":0},{"$f":"IF('201'!$M$2=2,COUNTIFS('201'!$M:$M,E22,'201'!$P:$P,0),0)","v":0},{"$f":"IF('202'!$M$2=2,COUNTIFS('202'!$M:$M,E22,'202'!$P:$P,1),0)","v":0},{"$f":"IF('202'!$M$2=2,COUNTIFS('202'!$M:$M,E22,'202'!$P:$P,0),0)","v":0},{"$f":"IF('203'!$M$2=2,COUNTIFS('203'!$M:$M,E22,'203'!$P:$P,1),0)","v":0},{"$f":"IF('203'!$M$2=2,COUNTIFS('203'!$M:$M,E22,'203'!$P:$P,0),0)","v":0},{"$f":"IF('204'!$M$2=2,COUNTIFS('204'!$M:$M,E22,'204'!$P:$P,1),0)","v":0},{"$f":"IF('204'!$M$2=2,COUNTIFS('204'!$M:$M,E22,'204'!$P:$P,0),0)","v":0},{"$f":"IF('205'!$M$2=2,COUNTIFS('205'!$M:$M,E22,'205'!$P:$P,1),0)","v":0},{"$f":"IF('205'!$M$2=2,COUNTIFS('205'!$M:$M,E22,'205'!$P:$P,0),0)","v":0},null,0,null,{"$error":"#DIV/0!"}]
[1,3,3,null,"1 ∙ 3",{"$f":"IF('201'!$M$2=1,COUNTIFS('201'!$M:$M,E23,'201'!$P:$P,1),0)","v":0},{"$f":"IF('201'!$M$2=1,COUNTIFS('201'!$M:$M,E23,'201'!$P:$P,0),0)","v":0},{"$f":"IF('202'!$M$2=1,COUNTIFS('202'!$M:$M,E23,'202'!$P:$P,1),0)","v":0},{"$f":"IF('202'!$M$2=1,COUNTIFS('202'!$M:$M,E23,'202'!$P:$P,0),0)","v":0},{"$f":"IF('203'!$M$2=1,COUNTIFS('203'!$M:$M,E23,'203'!$P:$P,1),0)","v":0},{"$f":"IF('203'!$M$2=1,COUNTIFS('203'!$M:$M,E23,'203'!$P:$P,0),0)","v":0},{"$f":"IF('204'!$M$2=1,COUNTIFS('204'!$M:$M,E23,'204'!$P:$P,1),0)","v":0},{"$f":"IF('204'!$M$2=1,COUNTIFS('204'!$M:$M,E23,'204'!$P:$P,0),0)","v":0},{"$f":"IF('205'!$M$2=1,COUNTIFS('205'!$M:$M,E23,'205'!$P:$P,1),0)","v":0},{"$f":"IF('205'!$M$2=1,COUNTIFS('205'!$M:$M,E23,'205'!$P:$P,0),0)","v":0},null,0,null,{"$error":"#DIV/0!"},null,null,null,{"$f":"IF('201'!$M$2=2,COUNTIFS('201'!$M:$M,E23,'201'!$P:$P,1),0)","v":0},{"$f":"IF('201'!$M$2=2,COUNTIFS('201'!$M:$M,E23,'201'!$P:$P,0),0)","v":0},{"$f":"IF('202'!$M$2=2,COUNTIFS('202'!$M:$M,E23,'202'!$P:$P,1),0)","v":0},{"$f":"IF('202'!$M$2=2,COUNTIFS('202'!$M:$M,E23,'202'!$P:$P,0),0)","v":0},{"$f":"IF('203'!$M$2=2,COUNTIFS('203'!$M:$M,E23,'203'!$P:$P,1),0)","v":0},{"$f":"IF('203'!$M$2=2,COUNTIFS('203'!$M:$M,E23,'203'!$P:$P,0),0)","v":0},{"$f":"IF('204'!$M$2=2,COUNTIFS('204'!$M:$M,E23,'204'!$P:$P,1),0)","v":0},{"$f":"IF('204'!$M$2=2,COUNTIFS('204'!$M:$M,E23,'204'!$P:$P,0),0)","v":0},{"$f":"IF('205'!$M$2=2,COUNTIFS('205'!$M:$M,E23,'205'!$P:$P,1),0)","v":0},{"$f":"IF('205'!$M$2=2,COUNTIFS('205'!$M:$M,E23,'205'!$P:$P,0),0)","v":0},null,0,null,{"$error":"#DIV/0!"}]
[2,3,6,null,"2 ∙ 3",{"$f":"IF('201'!$M$2=1,COUNTIFS('201'!$M:$M,E24,'201'!$P:$P,1),0)","v":0},{"$f":"IF('201'!$M$2=1,COUNTIFS('201'!$M:$M,E24,'201'!$P:$P,0),0)","v":0},{"$f":"IF('202'!$M$2=1,COUNTIFS('202'!$M:$M,E24,'202'!$P:$P,1),0)","v":0},{"$f":"IF('202'!$M$2=1,COUNTIFS('202'!$M:$M,E24,'202'!$P:$P,0),0)","v":0},{"$f":"IF('203'!$M$2=1,COUNTIFS('203'!$M:$M,E24,'203'!$P:$P,1),0)","v":0},{"$f":"IF('203'!$M$2=1,COUNTIFS('203'!$M:$M,E24,'203'!$P:$P,0),0)","v":0},{"$f":"IF('204'!$M$2=1,COUNTIFS('204'!$M:$M,E24,'204'!$P:$P,1),0)","v":0},{"$f":"IF('204'!$M$2=1,COUNTIFS('204'!$M:$M,E24,'204'!$P:$P,0),0)","v":0},{"$f":"IF('205'!$M$2=1,COUNTIFS('205'!$M:$M,E24,'205'!$P:$P,1),0)","v":0},{"$f":"IF('205'!$M$2=1,COUNTIFS('205'!$M:$M,E24,'205'!$P:$P,0),0)","v":0},null,0,null,{"$error":"#DIV/0!"},null,null,null,{"$f":"IF('201'!$M$2=2,COUNTIFS('201'!$M:$M,E24,'201'!$P:$P,1),0)","v":0},{"$f":"IF('201'!$M$2=2,COUNTIFS('201'!$M:$M,E24,'201'!$P:$P,0),0)","v":0},{"$f":"IF('202'!$M$2=2,COUNTIFS('202'!$M:$M,E24,'202'!$P:$P,1),0)","v":0},{"$f":"IF('202'!$M$2=2,COUNTIFS('202'!$M:$M,E24,'202'!$P:$P,0),0)","v":0},{"$f":"IF('203'!$M$2=2,COUNTIFS('203'!$M:$M,E24,'203'!$P:$P,1),0)","v":0},{"$f":"IF('203'!$M$2=2,COUNTIFS('203'!$M:$M,E24,'203'!$P:$P,0),0)","v":0},{"$f":"IF('204'!$M$2=2,COUNTIFS('204'!$M:$M,E24,'204'!$P:$P,1),0)","v":0},{"$f":"IF('204'!$M$2=2,COUNTIFS('204'!$M:$M,E24,'204'!$P:$P,0),0)","v":0},{"$f":"IF('205'!$M$2=2,COUNTIFS('205'!$M:$M,E24,'205'!$P:$P,1),0)","v":0},{"$f":"IF('205'!$M$2=2,COUNTIFS('205'!$M:$M,E24,'205'!$P:$P,0),0)","v":0},null,0,null,{"$error":"#DIV/0!"}]
[3,3,9,null,"3 ∙ 3",{"$f":"IF('201'!$M$2=1,COUNTIFS('201'!$M:$M,E25,'201'!$P:$P,1),0)","v":0},{"$f":"IF('201'!$M$2=1,COUNTIFS('201'!$M:$M,E25,'201'!$P:$P,0),0)","v":0},{"$f":"IF('202'!$M$2=1,COUNTIFS('202'!$M:$M,E25,'202'!$P:$P,1),0)","v":0},{"$f":"IF('202'!$M$2=1,COUNTIFS('202'!$M:$M,E25,'202'!$P:$P,0),0)","v":0},{"$f":"IF('203'!$M$2=1,COUNTIFS('203'!$M:$M,E25,'203'!$P:$P,1),0)","v":0},{"$f":"IF('203'!$M$2=1,COUNTIFS('203'!$M:$M,E25,'203'!$P:$P,0),0)","v":0},{"$f":"IF('204'!$M$2=1,COUNTIFS('204'!$M:$M,E25,'204'!$P:$P,1),0)","v":0},{"$f":"IF('204'!$M$2=1,COUNTIFS('204'!$M:$M,E25,'204'!$P:$P,0),0)","v":0},{"$f":"IF('205'!$M$2=1,COUNTIFS('205'!$M:$M,E25,'205'!$P:$P,1),0)","v":0},{"$f":"IF('205'!$M$2=1,COUNTIFS('205'!$M:$M,E25,'205'!$P:$P,0),0)","v":0},null,0,null,{"$error":"#DIV/0!"},null,null,null,{"$f":"IF('201'!$M$2=2,COUNTIFS('201'!$M:$M,E25,'201'!$P:$P,1),0)","v":0},{"$f":"IF('201'!$M$2=2,COUNTIFS('201'!$M:$M,E25,'201'!$P:$P,0),0)","v":0},{"$f":"IF('202'!$M$2=2,COUNTIFS('202'!$M:$M,E25,'202'!$P:$P,1),0)","v":0},{"$f":"IF('202'!$M$2=2,COUNTIFS('202'!$M:$M,E25,'202'!$P:$P,0),0)","v":0},{"$f":"IF('203'!$M$2=2,COUNTIFS('203'!$M:$M,E25,'203'!$P:$P,1),0)","v":0},{"$f":"IF('203'!$M$2=2,COUNTIFS('203'!$M:$M,E25,'203'!$P:$P,0),0)","v":0},{"$f":"IF('204'!$M$2=2,COUNTIFS('204'!$M:$M,E25,'204'!$P:$P,1),0)","v":0},{"$f":"IF('204'!$M$2=2,COUNTIFS('204'!$M:$M,E25,'204'!$P:$P,0),0)","v":0},{"$f":"IF('205'!$M$2=2,COUNTIFS('205'!$M:$M,E25,'205'!$P:$P,1),0)","v":0},{"$f":"IF('205'!$M$2=2,COUNTIFS('205'!$M:$M,E25,'205'!$P:$P,0),0)","v":0},null,0,null,{"$error":"#DIV/0!"}]
[4,3,12,null,"4 ∙ 3",{"$f":"IF('201'!$M$2=1,COUNTIFS('201'!$M:$M,E26,'201'!$P:$P,1),0)","v":0},{"$f":"IF('201'!$M$2=1,COUNTIFS('201'!$M:$M,E26,'201'!$P:$P,0),0)","v":0},{"$f":"IF('202'!$M$2=1,COUNTIFS('202'!$M:$M,E26,'202'!$P:$P,1),0)","v":0},{"$f":"IF('202'!$M$2=1,COUNTIFS('202'!$M:$M,E26,'202'!$P:$P,0),0)","v":0},{"$f":"IF('203'!$M$2=1,COUNTIFS('203'!$M:$M,E26,'203'!$P:$P,1),0)","v":0},{"$f":"IF('203'!$M$2=1,COUNTIFS('203'!$M:$M,E26,'203'!$P:$P,0),0)","v":0},{"$f":"IF('204'!$M$2=1,COUNTIFS('204'!$M:$M,E26,'204'!$P:$P,1),0)","v":0},{"$f":"IF('204'!$M$2=1,COUNTIFS('204'!$M:$M,E26,'204'!$P:$P,0),0)","v":0},{"$f":"IF('205'!$M$2=1,COUNTIFS('205'!$M:$M,E26,'205'!$P:$P,1),0)","v":0},{"$f":"IF('205'!$M$2=1,COUNTIFS('205'!$M:$M,E26,'205'!$P:$P,0),0)","v":0},null,0,null,{"$error":"#DIV/0!"},null,null,null,{"$f":"IF('201'!$M$2=2,COUNTIFS('201'!$M:$M,E26,'201'!$P:$P,1),0)","v":0},{"$f":"IF('201'!$M$2=2,COUNTIFS('201'!$M:$M,E26,'201'!$P:$P,0),0)","v":0},{"$f":"IF('202'!$M$2=2,COUNTIFS('202'!$M:$M,E26,'202'!$P:$P,1),0)","v":0},{"$f":"IF('202'!$M$2=2,COUNTIFS('202'!$M:$M,E26,'202'!$P:$P,0),0)","v":0},{"$f":"IF('203'!$M$2=2,COUNTIFS('203'!$M:$M,E26,'203'!$P:$P,1),0)","v":0},{"$f":"IF('203'!$M$2=2,COUNTIFS('203'!$M:$M,E26,'203'!$P:$P,0),0)","v":0},{"$f":"IF('204'!$M$2=2,COUNTIFS('204'!$M:$M,E26,'204'!$P:$P,1),0)","v":0},{"$f":"IF('204'!$M$2=2,COUNTIFS('204'!$M:$M,E26,'204'!$P:$P,0),0)","v":0},{"$f":"IF('205'!$M$2=2,COUNTIFS('205'!$M:$M,E26,'205'!$P:$P,1),0)","v":0},{"$f":"IF('205'!$M$2=2,COUNTIFS('205'!$M:$M,E26,'205'!$P:$P,0),0)","v":0},null,0,null,{"$error":"#DIV/0!"}]
[5,3,15,null,"5 ∙ 3",{"$f":"IF('201'!$M$2=1,COUNTIFS('201'!$M:$M,E27,'201'!$P:$P,1),0)","v":0},{"$f":"IF('201'!$M$2=1,COUNTIFS('201'!$M:$M,E27,'201'!$P:$P,0),0)","v":0},{"$f":"IF('202'!$M$2=1,COUNTIFS('202'!$M:$M,E27,'202'!$P:$P,1),0)","v":0},{"$f":"IF('202'!$M$2=1,COUNTIFS('202'!$M:$M,E27,'202'!$P:$P,0),0)","v":0},{"$f":"IF('203'!$M$2=1,COUNTIFS('203'!$M:$M,E27,'203'!$P:$P,1),0)","v":0},{"$f":"IF('203'!$M$2=1,COUNTIFS('203'!$M:$M,E27,'203'!$P:$P,0),0)","v":0},{"$f":"IF('204'!$M$2=1,COUNTIFS('204'!$M:$M,E27,'204'!$P:$P,1),0)","v":0},{"$f":"IF('204'!$M$2=1,COUNTIFS('204'!$M:$M,E27,'204'!$P:$P,0),0)","v":0},{"$f":"IF('205'!$M$2=1,COUNTIFS('205'!$M:$M,E27,'205'!$P:$P,1),0)","v":0},{"$f":"IF('205'!$M$2=1,COUNTIFS('205'!$M:$M,E27,'205'!$P:$P,0),0)","v":0},null,0,null,{"$error":"#DIV/0!"},null,null,null,{"$f":"IF('201'!$M$2=2,COUNTIFS('201'!$M:$M,E27,'201'!$P:$P,1),0)","v":0},{"$f":"IF('201'!$M$2=2,COUNTIFS('201'!$M:$M,E27,'201'!$P:$P,0),0)","v":0},{"$f":"IF('202'!$M$2=2,COUNTIFS('202'!$M:$M,E27,'202'!$P:$P,1),0)","v":0},{"$f":"IF('202'!$M$2=2,COUNTIFS('202'!$M:$M,E27,'202'!$P:$P,0),0)","v":0},{"$f":"IF('203'!$M$2=2,COUNTIFS('203'!$M:$M,E27,'203'!$P:$P,1),0)","v":0},{"$f":"IF('203'!$M$2=2,COUNTIFS('203'!$M:$M,E27,'203'!$P:$P,0),0)","v":0},{"$f":"IF('204'!$M$2=2,COUNTIFS('204'!$M:$M,E27,'204'!$P:$P,1),0)","v":0},{"$f":"IF('204'!$M$2=2,COUNTIFS('204'!$M:$M,E27,'204'!$P:$P,0),0)","v":0},{"$f":"IF('205'!$M$2=2,COUNTIFS('205'!$M:$M,E27,'205'!$P:$P,1),0)","v":0},{"$f":"IF('205'!$M$2=2,COUNTIFS('205'!$M:$M,E27,'205'!$P:$P,0),0)","v":0},null,0,null,{"$error":"#DIV/0!"}]
[6,3,18,null,"6 ∙ 3",{"$f":"IF('201'!$M$2=1,COUNTIFS('201'!$M:$M,E28,'201'!$P:$P,1),0)","v":0},{"$f":"IF('201'!$M$2=1,COUNTIFS('201'!$M:$M,E28,'201'!$P:$P,0),0)","v":0},{"$f":"IF('202'!$M$2=1,COUNTIFS('202'!$M:$M,E28,'202'!$P:$P,1),0)","v":0},{"$f":"IF('202'!$M$2=1,COUNTIFS('202'!$M:$M,E28,'202'!$P:$P,0),0)","v":0},{"$f":"IF('203'!$M$2=1,COUNTIFS('203'!$M:$M,E28,'203'!$P:$P,1),0)","v":0},{"$f":"IF('203'!$M$2=1,COUNTIFS('203'!$M:$M,E28,'203'!$P:$P,0),0)","v":0},{"$f":"IF('204'!$M$2=1,COUNTIFS('204'!$M:$M,E28,'204'!$P:$P,1),0)","v":0},{"$f":"IF('204'!$M$2=1,COUNTIFS('204'!$M:$M,E28,'204'!$P:$P,0),0)","v":0},{"$f":"IF('205'!$M$2=1,COUNTIFS('205'!$M:$M,E28,'205'!$P:$P,1),0)","v":0},{"$f":"IF('205'!$M$2=1,COUNTIFS('205'!$M:$M,E28,'205'!$P:$P,0),0)","v":0},null,0,null,{"$error":"#DIV/0!"},null,null,null,{"$f":"IF('201'!$M$2=2,COUNTIFS('201'!$M:$M,E28,'201'!$P:$P,1),0)","v":0},{"$f":"IF('201'!$M$2=2,COUNTIFS('201'!$M:$M,E28,'201'!$P:$P,0),0)","v":0},{"$f":"IF('202'!$M$2=2,COUNTIFS('202'!$M:$M,E28,'202'!$P:$P,1),0)","v":0},{"$f":"IF('202'!$M$2=2,COUNTIFS('202'!$M:$M,E28,'202'!$P:$P,0),0)","v":0},{"$f":"IF('203'!$M$2=2,COUNTIFS('203'!$M:$M,E28,'203'!$P:$P,1),0)","v":0},{"$f":"IF('203'!$M$2=2,COUNTIFS('203'!$M:$M,E28,'203'!$P:$P,0),0)","v":0},{"$f":"IF('204'!$M$2=2,COUNTIFS('204'!$M:$M,E28,'204'!$P:$P,1),0)","v":0},{"$f":"IF('204'!$M$2=2,COUNTIFS('204'!$M:$M,E28,'204'!$P:$P,0),0)","v":0},{"$f":"IF('205'!$M$2=2,COUNTIFS('205'!$M:$M,E28,'205'!$P:$P,1),0)","v":0},{"$f":"IF('205'!$M$2=2,COUNTIFS('205'!$M:$M,E28,'205'!$P:$P,0),0)","v":0},null,0,null,{"$error":"#DIV/0!"}]
[7,3,21,null,"7 ∙ 3",{"$f":"IF('201'!$M$2=1,COUNTIFS('201'!$M:$M,E29,'201'!$P:$P,1),0)","v":0},{"$f":"IF('201'!$M$2=1,COUNTIFS('201'!$M:$M,E29,'201'!$P:$P,0),0)","v":0},{"$f":"IF('202'!$M$2=1,COUNTIFS('202'!$M:$M,E29,'202'!$P:$P,1),0)","v":0},{"$f":"IF('202'!$M$2=1,COUNTIFS('202'!$M:$M,E29,'202'!$P:$P,0),0)","v":0},{"$f":"IF('203'!$M$2=1,COUNTIFS('203'!$M:$M,E29,'203'!$P:$P,1),0)","v":0},{"$f":"IF('203'!$M$2=1,COUNTIFS('203'!$M:$M,E29,'203'!$P:$P,0),0)","v":0},{"$f":"IF('204'!$M$2=1,COUNTIFS('204'!$M:$M,E29,'204'!$P:$P,1),0)","v":0},{"$f":"IF('204'!$M$2=1,COUNTIFS('204'!$M:$M,E29,'204'!$P:$P,0),0)","v":0},{"$f":"IF('205'!$M$2=1,COUNTIFS('205'!$M:$M,E29,'205'!$P:$P,1),0)","v":0},{"$f":"IF('205'!$M$2=1,COUNTIFS('205'!$M:$M,E29,'205'!$P:$P,0),0)","v":0},null,0,null,{"$error":"#DIV/0!"},null,null,null,{"$f":"IF('201'!$M$2=2,COUNTIFS('201'!$M:$M,E29,'201'!$P:$P,1),0)","v":0},{"$f":"IF('201'!$M$2=2,COUNTIFS('201'!$M:$M,E29,'201'!$P:$P,0),0)","v":0},{"$f":"IF('202'!$M$2=2,COUNTIFS('202'!$M:$M,E29,'202'!$P:$P,1),0)","v":0},{"$f":"IF('202'!$M$2=2,COUNTIFS('202'!$M:$M,E29,'202'!$P:$P,0),0)","v":0},{"$f":"IF('203'!$M$2=2,COUNTIFS('203'!$M:$M,E29,'203'!$P:$P,1),0)","v":0},{"$f":"IF('203'!$M$2=2,COUNTIFS('203'!$M:$M,E29,'203'!$P:$P,0),0)","v":0},{"$f":"IF('204'!$M$2=2,COUNTIFS('204'!$M:$M,E29,'204'!$P:$P,1),0)","v":0},{"$f":"IF('204'!$M$2=2,COUNTIFS('204'!$M:$M,E29,'204'!$P:$P,0),0)","v":0},{"$f":"IF('205'!$M$2=2,COUNTIFS('205'!$M:$M,E29,'205'!$P:$P,1),0)","v":0},{"$f":"IF('205'!$M$2=2,COUNTIFS('205'!$M:$M,E29,'205'!$P:$P,0),0)","v":0},null,0,null,{"$error":"#DIV/0!"}]
[8,3,24,null,"8 ∙ 3",{"$f":"IF('201'!$M$2=1,COUNTIFS('201'!$M:$M,E30,'201'!$P:$P,1),0)","v":0},{"$f":"IF('201'!$M$2=1,COUNTIFS('201'!$M:$M,E30,'201'!$P:$P,0),0)","v":0},{"$f":"IF('202'!$M$2=1,COUNTIFS('202'!$M:$M,E30,'202'!$P:$P,1),0)","v":0},{"$f":"IF('202'!$M$2=1,COUNTIFS('202'!$M:$M,E30,'202'!$P:$P,0),0)","v":0},{"$f":"IF('203'!$M$2=1,COUNTIFS('203'!$M:$M,E30,'203'!$P:$P,1),0)","v":0},{"$f":"IF('203'!$M$2=1,COUNTIFS('203'!$M:$M,E30,'203'!$P:$P,0),0)","v":0},{"$f":"IF('204'!$M$2=1,COUNTIFS('204'!$M:$M,E30,'204'!$P:$P,1),0)","v":0},{"$f":"IF('204'!$M$2=1,COUNTIFS('204'!$M:$M,E30,'204'!$P:$P,0),0)","v":0},{"$f":"IF('205'!$M$2=1,COUNTIFS('205'!$M:$M,E30,'205'!$P:$P,1),0)","v":0},{"$f":"IF('205'!$M$2=1,COUNTIFS('205'!$M:$M,E30,'205'!$P:$P,0),0)","v":0},null,0,null,{"$error":"#DIV/0!"},null,null,null,{"$f":"IF('201'!$M$2=2,COUNTIFS('201'!$M:$M,E30,'201'!$P:$P,1),0)","v":0},{"$f":"IF('201'!$M$2=2,COUNTIFS('201'!$M:$M,E30,'201'!$P:$P,0),0)","v":0},{"$f":"IF('202'!$M$2=2,COUNTIFS('202'!$M:$M,E30,'202'!$P:$P,1),0)","v":0},{"$f":"IF('202'!$M$2=2,COUNTIFS('202'!$M:$M,E30,'202'!$P:$P,0),0)","v":0},{"$f":"IF('203'!$M$2=2,COUNTIFS('203'!$M:$M,E30,'203'!$P:$P,1),0)","v":0},{"$f":"IF('203'!$M$2=2,COUNTIFS('203'!$M:$M,E30,'203'!$P:$P,0),0)","v":0},{"$f":"IF('204'!$M$2=2,COUNTIFS('204'!$M:$M,E30,'204'!$P:$P,1),0)","v":0},{"$f":"IF('204'!$M$2=2,COUNTIFS('204'!$M:$M,E30,'204'!$P:$P,0),0)","v":0},{"$f":"IF('205'!$M$2=2,COUNTIFS('205'!$M:$M,E30,'205'!$P:$P,1),0)","v":0},{"$f":"IF('205'!$M$2=2,COUNTIFS('205'!$M:$M,E30,'205'!$P:$P,0),0)","v":0},null,0,null,{"$error":"#DIV/0!"}]
[9,3,27,null,"9 ∙ 3",{"$f":"IF('201'!$M$2=1,COUNTIFS('201'!$M:$M,E31,'201'!$P:$P,1),0)","v":0},{"$f":"IF('201'!$M$2=1,COUNTIFS('201'!$M:$M,E31,'201'!$P:$P,0),0)","v":0},{"$f":"IF('202'!$M$2=1,COUNTIFS('202'!$M:$M,E31,'202'!$P:$P,1),0)","v":0},{"$f":"IF('202'!$M$2=1,COUNTIFS('202'!$M:$M,E31,'202'!$P:$P,0),0)","v":0},{"$f":"IF('203'!$M$2=1,COUNTIFS('203'!$M:$M,E31,'203'!$P:$P,1),0)","v":0},{"$f":"IF('203'!$M$2=1,COUNTIFS('203'!$M:$M,E31,'203'!$P:$P,0),0)","v":0},{"$f":"IF('204'!$M$2=1,COUNTIFS('204'!$M:$M,E31,'204'!$P:$P,1),0)","v":0},{"$f":"IF('204'!$M$2=1,COUNTIFS('204'!$M:$M,E31,'204'!$P:$P,0),0)","v":0},{"$f":"IF('205'!$M$2=1,COUNTIFS('205'!$M:$M,E31,'205'!$P:$P,1),0)","v":0},{"$f":"IF('205'!$M$2=1,COUNTIFS('205'!$M:$M,E31,'205'!$P:$P,0),0)","v":0},null,0,null,{"$error":"#DIV/0!"},null,null,null,{"$f":"IF('201'!$M$2=2,COUNTIFS('201'!$M:$M,E31,'201'!$P:$P,1),0)","v":0},{"$f":"IF('201'!$M$2=2,COUNTIFS('201'!$M:$M,E31,'201'!$P:$P,0),0)","v":0},{"$f":"IF('202'!$M$2=2,COUNTIFS('202'!$M:$M,E31,'202'!$P:$P,1),0)","v":0},{"$f":"IF('202'!$M$2=2,COUNTIFS('202'!$M:$M,E31,'202'!$P:$P,0),0)","v":0},{"$f":"IF('203'!$M$2=2,COUNTIFS('203'!$M:$M,E31,'203'!$P:$P,1),0)","v":0},{"$f":"IF('203'!$M$2=2,COUNTIFS('203'!$M:$M,E31,'203'!$P:$P,0),0)","v":0},{"$f":"IF('204'!$M$2=2,COUNTIFS('204'!$M:$M,E31,'204'!$P:$P,1),0)","v":0},{"$f":"IF('204'!$M$2=2,COUNTIFS('204'!$M:$M,E31,'204'!$P:$P,0),0)","v":0},{"$f":"IF('205'!$M$2=2,COUNTIFS('205'!$M:$M,E31,'205'!$P:$P,1),0)","v":0},{"$f":"IF('205'!$M$2=2,COUNTIFS('205'!$M:$M,E31,'205'!$P:$P,0),0)","v":0},null,0,null,{"$error":"#DIV/0!"}]
[10,3,30,null,"10 ∙ 3",{"$f":"IF('201'!$M$2=1,COUNTIFS('201'!$M:$M,E32,'201'!$P:$P,1),0)","v":0},{"$f":"IF('201'!$M$2=1,COUNTIFS('201'!$M:$M,E32,'201'!$P:$P,0),0)","v":0},{"$f":"IF('202'!$M$2=1,COUNTIFS('202'!$M:$M,E32,'202'!$P:$P,1),0)","v":0},{"$f":"IF('202'!$M$2=1,COUNTIFS('202'!$M:$M,E32,'202'!$P:$P,0),0)","v":0},{"$f":"IF('203'!$M$2=1,COUNTIFS('203'!$M:$M,E32,'203'!$P:$P,1),0)","v":0},{"$f":"IF('203'!$M$2=1,COUNTIFS('203'!$M:$M,E32,'203'!$P:$P,0),0)","v":0},{"$f":"IF('204'!$M$2=1,COUNTIFS('204'!$M:$M,E32,'204'!$P:$P,1),0)","v":0},{"$f":"IF('204'!$M$2=1,COUNTIFS('204'!$M:$M,E32,'204'!$P:$P,0),0)","v":0},{"$f":"IF('205'!$M$2=1,COUNTIFS('205'!$M:$M,E32,'205'!$P:$P,1),0)","v":0},{"$f":"IF('205'!$M$2=1,COUNTIFS('205'!$M:$M,E32,'205'!$P:$P,0),0)","v":0},null,0,null,{"$error":"#DIV/0!"},null,null,null,{"$f":"IF('201'!$M$2=2,COUNTIFS('201'!$M:$M,E32,'201'!$P:$P,1),0)","v":0},{"$f":"IF('201'!$M$2=2,COUNTIFS('201'!$M:$M,E32,'201'!$P:$P,0),0)","v":0},{"$f":"IF('202'!$M$2=2,COUNTIFS('202'!$M:$M,E32,'202'!$P:$P,1),0)","v":0},{"$f":"IF('202'!$M$2=2,COUNTIFS('202'!$M:$M,E32,'202'!$P:$P,0),0)","v":0},{"$f":"IF('203'!$M$2=2,COUNTIFS('203'!$M:$M,E32,'203'!$P:$P,1),0)","v":0},{"$f":"IF('203'!$M$2=2,COUNTIFS('203'!$M:$M,E32,'203'!$P:$P,0),0)","v":0},{"$f":"IF('204'!$M$2=2,COUNTIFS('204'!$M:$M,E32,'204'!$P:$P,1),0)","v":0},{"$f":"IF('204'!$M$2=2,COUNTIFS('204'!$M:$M,E32,'204'!$P:$P,0),0)","v":0},{"$f":"IF('205'!$M$2=2,COUNTIFS('205'!$M:$M,E32,'205'!$P:$P,1),0)","v":0},{"$f":"IF('205'!$M$2=2,COUNTIFS('205'!$M:$M,E32,'205'!$P:$P,0),0)","v":0},null,0,null,{"$error":"#DIV/0!"}]
[1,4,4,null,"1 ∙ 4",{"$f":"IF('201'!$M$2=1,COUNTIFS('201'!$M:$M,E33,'201'!$P:$P,1),0)","v":0},{"$f":"IF('201'!$M$2=1,COUNTIFS('201'!$M:$M,E33,'201'!$P:$P,0),0)","v":0},{"$f":"IF('202'!$M$2=1,COUNTIFS('202'!$M:$M,E33,'202'!$P:$P,1),0)","v":0},{"$f":"IF('202'!$M$2=1,COUNTIFS('202'!$M:$M,E33,'202'!$P:$P,0),0)","v":0},{"$f":"IF('203'!$M$2=1,COUNTIFS('203'!$M:$M,E33,'203'!$P:$P,1),0)","v":0},{"$f":"IF('203'!$M$2=1,COUNTIFS('203'!$M:$M,E33,'203'!$P:$P,0),0)","v":0},{"$f":"IF('204'!$M$2=1,COUNTIFS('204'!$M:$M,E33,'204'!$P:$P,1),0)","v":0},{"$f":"IF('204'!$M$2=1,COUNTIFS('204'!$M:$M,E33,'204'!$P:$P,0),0)","v":0},{"$f":"IF('205'!$M$2=1,COUNTIFS('205'!$M:$M,E33,'205'!$P:$P,1),0)","v":0},{"$f":"IF('205'!$M$2=1,COUNTIFS('205'!$M:$M,E33,'205'!$P:$P,0),0)","v":0},null,0,null,{"$error":"#DIV/0!"},null,null,null,{"$f":"IF('201'!$M$2=2,COUNTIFS('201'!$M:$M,E33,'201'!$P:$P,1),0)","v":0},{"$f":"IF('201'!$M$2=2,COUNTIFS('201'!$M:$M,E33,'201'!$P:$P,0),0)","v":0},{"$f":"IF('202'!$M$2=2,COUNTIFS('202'!$M:$M,E33,'202'!$P:$P,1),0)","v":0},{"$f":"IF('202'!$M$2=2,COUNTIFS('202'!$M:$M,E33,'202'!$P:$P,0),0)","v":0},{"$f":"IF('203'!$M$2=2,COUNTIFS('203'!$M:$M,E33,'203'!$P:$P,1),0)","v":0},{"$f":"IF('203'!$M$2=2,COUNTIFS('203'!$M:$M,E33,'203'!$P:$P,0),0)","v":0},{"$f":"IF('204'!$M$2=2,COUNTIFS('204'!$M:$M,E33,'204'!$P:$P,1),0)","v":0},{"$f":"IF('204'!$M$2=2,COUNTIFS('204'!$M:$M,E33,'204'!$P:$P,0),0)","v":0},{"$f":"IF('205'!$M$2=2,COUNTIFS('205'!$M:$M,E33,'205'!$P:$P,1),0)","v":0},{"$f":"IF('205'!$M$2=2,COUNTIFS('205'!$M:$M,E33,'205'!$P:$P,0),0)","v":0},null,0,null,{"$error":"#DIV/0!"}]
[2,4,8,null,"2 ∙ 4",{"$f":"IF('201'!$M$2=1,COUNTIFS('201'!$M:$M,E34,'201'!$P:$P,1),0)","v":0},{"$f":"IF('201'!$M$2=1,COUNTIFS('201'!$M:$M,E34,'201'!$P:$P,0),0)","v":0},{"$f":"IF('202'!$M$2=1,COUNTIFS('202'!$M:$M,E34,'202'!$P:$P,1),0)","v":0},{"$f":"IF('202'!$M$2=1,COUNTIFS('202'!$M:$M,E34,'202'!$P:$P,0),0)","v":0},{"$f":"IF('203'!$M$2=1,COUNTIFS('203'!$M:$M,E34,'203'!$P:$P,1),0)","v":0},{"$f":"IF('203'!$M$2=1,COUNTIFS('203'!$M:$M,E34,'203'!$P:$P,0),0)","v":0},{"$f":"IF('204'!$M$2=1,COUNTIFS('204'!$M:$M,E34,'204'!$P:$P,1),0)","v":0},{"$f":"IF('204'!$M$2=1,COUNTIFS('204'!$M:$M,E34,'204'!$P:$P,0),0)","v":0},{"$f":"IF('205'!$M$2=1,COUNTIFS('205'!$M:$M,E34,'205'!$P:$P,1),0)","v":0},{"$f":"IF('205'!$M$2=1,COUNTIFS('205'!$M:$M,E34,'205'!$P:$P,0),0)","v":0},null,0,null,{"$error":"#DIV/0!"},null,null,null,{"$f":"IF('201'!$M$2=2,COUNTIFS('201'!$M:$M,E34,'201'!$P:$P,1),0)","v":0},{"$f":"IF('201'!$M$2=2,COUNTIFS('201'!$M:$M,E34,'201'!$P:$P,0),0)","v":0},{"$f":"IF('202'!$M$2=2,COUNTIFS('202'!$M:$M,E34,'202'!$P:$P,1),0)","v":0},{"$f":"IF('202'!$M$2=2,COUNTIFS('202'!$M:$M,E34,'202'!$P:$P,0),0)","v":0},{"$f":"IF('203'!$M$2=2,COUNTIFS('203'!$M:$M,E34,'203'!$P:$P,1),0)","v":0},{"$f":"IF('203'!$M$2=2,COUNTIFS('203'!$M:$M,E34,'203'!$P:$P,0),0)","v":0},{"$f":"IF('204'!$M$2=2,COUNTIFS('204'!$M:$M,E34,'204'!$P:$P,1),0)","v":0},{"$f":"IF('204'!$M$2=2,COUNTIFS('204'!$M:$M,E34,'204'!$P:$P,0),0)","v":0},{"$f":"IF('205'!$M$2=2,COUNTIFS('205'!$M:$M,E34,'205'!$P:$P,1),0)","v":0},{"$f":"IF('205'!$M$2=2,COUNTIFS('205'!$M:$M,E34,'205'!$P:$P,0),0)","v":0},null,0,null,{"$error":"#DIV/0!"}]
[3,4,12,null,"3 ∙ 4",{"$f":"IF('201'!$M$2=1,COUNTIFS('201'!$M:$M,E35,'201'!$P:$P,1),0)","v":0},{"$f":"IF('201'!$M$2=1,COUNTIFS('201'!$M:$M,E35,'201'!$P:$P,0),0)","v":0},{"$f":"IF('202'!$M$2=1,COUNTIFS('202'!$M:$M,E35,'202'!$P:$P,1),0)","v":0},{"$f":"IF('202'!$M$2=1,COUNTIFS('202'!$M:$M,E35,'202'!$P:$P,0),0)","v":0},{"$f":"IF('203'!$M$2=1,COUNTIFS('203'!$M:$M,E35,'203'!$P:$P,1),0)","v":0},{"$f":"IF('203'!$M$2=1,COUNTIFS('203'!$M:$M,E35,'203'!$P:$P,0),0)","v":0},{"$f":"IF('204'!$M$2=1,COUNTIFS('204'!$M:$M,E35,'204'!$P:$P,1),0)","v":0},{"$f":"IF('204'!$M$2=1,COUNTIFS('204'!$M:$M,E35,'204'!$P:$P,0),0)","v":0},{"$f":"IF('205'!$M$2=1,COUNTIFS('205'!$M:$M,E35,'205'!$P:$P,1),0)","v":0},{"$f":"IF('205'!$M$2=1,COUNTIFS('205'!$M:$M,E35,'205'!$P:$P,0),0)","v":0},null,{"$f":"SUM(F35:O35)","v":0},null,{"$f":"SUM(F35,H35,J35,L35,N35)/Q35","v":{"$error":"#DIV/0!"}},null,null,null,{"$f":"IF('201'!$M$2=2,COUNTIFS('201'!$M:$M,E35,'201'!$P:$P,1),0)","v":0},{"$f":"IF('201'!$M$2=2,COUNTIFS('201'!$M:$M,E35,'201'!$P:$P,0),0)","v":0},{"$f":"IF('202'!$M$2=2,COUNTIFS('202'!$M:$M,E35,'202'!$P:$P,1),0)","v":0},{"$f":"IF('202'!$M$2=2,COUNTIFS('202'!$M:$M,E35,'202'!$P:$P,0),0)","v":0},{"$f":"IF('203'!$M$2=2,COUNTIFS('203'!$M:$M,E35,'203'!$P:$P,1),0)","v":0},{"$f":"IF('203'!$M$2=2,COUNTIFS('203'!$M:$M,E35,'203'!$P:$P,0),0)","v":0},{"$f":"IF('204'!$M$2=2,COUNTIFS('204'!$M:$M,E35,'204'!$P:$P,1),0)","v":0},{"$f":"IF('204'!$M$2=2,COUNTIFS('204'!$M:$M,E35,'204'!$P:$P,0),0)","v":0},{"$f":"IF('205'!$M$2=2,COUNTIFS('205'!$M:$M,E35,'205'!$P:$P,1),0)","v":0},{"$f":"IF('205'!$M$2=2,COUNTIFS('205'!$M:$M,E35,'205'!$P:$P,0),0)","v":0},null,{"$f":"SUM(W35:AF35)","v":0},null,{"$f":"SUM(W35,Y35,AA35,AC35,AE35)/AH35","v":{"$error":"#DIV/0!"}}]
[4,4,16,null,"4 ∙ 4",{"$f":"IF('201'!$M$2=1,COUNTIFS('201'!$M:$M,E36,'201'!$P:$P,1),0)","v":0},{"$f":"IF('201'!$M$2=1,COUNTIFS('201'!$M:$M,E36,'201'!$P:$P,0),0)","v":0},{"$f":"IF('202'!$M$2=1,COUNTIFS('202'!$M:$M,E36,'202'!$P:$P,1),0)","v":0},{"$f":"IF('202'!$M$2=1,COUNTIFS('202'!$M:$M,E36,'202'!$P:$P,0),0)","v":0},{"$f":"IF('203'!$M$2=1,COUNTIFS('203'!$M:$M,E36,'203'!$P:$P,1),0)","v":0},{"$f":"IF('203'!$M$2=1,COUNTIFS('203'!$M:$M,E36,'203'!$P:$P,0),0)","v":0},{"$f":"IF('204'!$M$2=1,COUNTIFS('204'!$M:$M,E36,'204'!$P:$P,1),0)","v":0},{"$f":"IF('204'!$M$2=1,COUNTIFS('204'!$M:$M,E36,'204'!$P:$P,0),0)","v":0},{"$f":"IF('205'!$M$2=1,COUNTIFS('205'!$M:$M,E36,'205'!$P:$P,1),0)","v":0},{"$f":"IF('205'!$M$2=1,COUNTIFS('205'!$M:$M,E36,'205'!$P:$P,0),0)","v":0},null,0,null,{"$error":"#DIV/0!"},null,null,null,{"$f":"IF('201'!$M$2=2,COUNTIFS('201'!$M:$M,E36,'201'!$P:$P,1),0)","v":0},{"$f":"IF('201'!$M$2=2,COUNTIFS('201'!$M:$M,E36,'201'!$P:$P,0),0)","v":0},{"$f":"IF('202'!$M$2=2,COUNTIFS('202'!$M:$M,E36,'202'!$P:$P,1),0)","v":0},{"$f":"IF('202'!$M$2=2,COUNTIFS('202'!$M:$M,E36,'202'!$P:$P,0),0)","v":0},{"$f":"IF('203'!$M$2=2,COUNTIFS('203'!$M:$M,E36,'203'!$P:$P,1),0)","v":0},{"$f":"IF('203'!$M$2=2,COUNTIFS('203'!$M:$M,E36,'203'!$P:$P,0),0)","v":0},{"$f":"IF('204'!$M$2=2,COUNTIFS('204'!$M:$M,E36,'204'!$P:$P,1),0)","v":0},{"$f":"IF('204'!$M$2=2,COUNTIFS('204'!$M:$M,E36,'204'!$P:$P,0),0)","v":0},{"$f":"IF('205'!$M$2=2,COUNTIFS('205'!$M:$M,E36,'205'!$P:$P,1),0)","v":0},{"$f":"IF('205'!$M$2=2,COUNTIFS('205'!$M:$M,E36,'205'!$P:$P,0),0)","v":0},null,0,null,{"$error":"#DIV/0!"}]
[5,4,20,null,"5 ∙ 4",{"$f":"IF('201'!$M$2=1,COUNTIFS('201'!$M:$M,E37,'201'!$P:$P,1),0)","v":0},{"$f":"IF('201'!$M$2=1,COUNTIFS('201'!$M:$M,E37,'201'!$P:$P,0),0)","v":0},{"$f":"IF('202'!$M$2=1,COUNTIFS('202'!$M:$M,E37,'202'!$P:$P,1),0)","v":0},{"$f":"IF('202'!$M$2=1,COUNTIFS('202'!$M:$M,E37,'202'!$P:$P,0),0)","v":0},{"$f":"IF('203'!$M$2=1,COUNTIFS('203'!$M:$M,E37,'203'!$P:$P,1),0)","v":0},{"$f":"IF('203'!$M$2=1,COUNTIFS('203'!$M:$M,E37,'203'!$P:$P,0),0)","v":0},{"$f":"IF('204'!$M$2=1,COUNTIFS('204'!$M:$M,E37,'204'!$P:$P,1),0)","v":0},{"$f":"IF('204'!$M$2=1,COUNTIFS('204'!$M:$M,E37,'204'!$P:$P,0),0)","v":0},{"$f":"IF('205'!$M$2=1,COUNTIFS('205'!$M:$M,E37,'205'!$P:$P,1),0)","v":0},{"$f":"IF('205'!$M$2=1,COUNTIFS('205'!$M:$M,E37,'205'!$P:$P,0),0)","v":0},null,0,null,{"$error":"#DIV/0!"},null,null,null,{"$f":"IF('201'!$M$2=2,COUNTIFS('201'!$M:$M,E37,'201'!$P:$P,1),0)","v":0},{"$f":"IF('201'!$M$2=2,COUNTIFS('201'!$M:$M,E37,'201'!$P:$P,0),0)","v":0},{"$f":"IF('202'!$M$2=2,COUNTIFS('202'!$M:$M,E37,'202'!$P:$P,1),0)","v":0},{"$f":"IF('202'!$M$2=2,COUNTIFS('202'!$M:$M,E37,'202'!$P:$P,0),0)","v":0},{"$f":"IF('203'!$M$2=2,COUNTIFS('203'!$M:$M,E37,'203'!$P:$P,1),0)","v":0},{"$f":"IF('203'!$M$2=2,COUNTIFS('203'!$M:$M,E37,'203'!$P:$P,0),0)","v":0},{"$f":"IF('204'!$M$2=2,COUNTIFS('204'!$M:$M,E37,'204'!$P:$P,1),0)","v":0},{"$f":"IF('204'!$M$2=2,COUNTIFS('204'!$M:$M,E37,'204'!$P:$P,0),0)","v":0},{"$f":"IF('205'!$M$2=2,COUNTIFS('205'!$M:$M,E37,'205'!$P:$P,1),0)","v":0},{"$f":"IF('205'!$M$2=2,COUNTIFS('205'!$M:$M,E37,'205'!$P:$P,0),0)","v":0},null,0,null,{"$error":"#DIV/0!"}]
[6,4,24,null,"6 ∙ 4",{"$f":"IF('201'!$M$2=1,COUNTIFS('201'!$M:$M,E38,'201'!$P:$P,1),0)","v":0},{"$f":"IF('201'!$M$2=1,COUNTIFS('201'!$M:$M,E38,'201'!$P:$P,0),0)","v":0},{"$f":"IF('202'!$M$2=1,COUNTIFS('202'!$M:$M,E38,'202'!$P:$P,1),0)","v":0},{"$f":"IF('202'!$M$2=1,COUNTIFS('202'!$M:$M,E38,'202'!$P:$P,0),0)","v":0},{"$f":"IF('203'!$M$2=1,COUNTIFS('203'!$M:$M,E38,'203'!$P:$P,1),0)","v":0},{"$f":"IF('203'!$M$2=1,COUNTIFS('203'!$M:$M,E38,'203'!$P:$P,0),0)","v":0},{"$f":"IF('204'!$M$2=1,COUNTIFS('204'!$M:$M,E38,'204'!$P:$P,1),0)","v":0},{"$f":"IF('204'!$M$2=1,COUNTIFS('204'!$M:$M,E38,'204'!$P:$P,0),0)","v":0},{"$f":"IF('205'!$M$2=1,COUNTIFS('205'!$M:$M,E38,'205'!$P:$P,1),0)","v":0},{"$f":"IF('205'!$M$2=1,COUNTIFS('205'!$M:$M,E38,'205'!$P:$P,0),0)","v":0},null,0,null,{"$error":"#DIV/0!"},null,null,null,{"$f":"IF('201'!$M$2=2,COUNTIFS('201'!$M:$M,E38,'201'!$P:$P,1),0)","v":0},{"$f":"IF('201'!$M$2=2,COUNTIFS('201'!$M:$M,E38,'201'!$P:$P,0),0)","v":0},{"$f":"IF('202'!$M$2=2,COUNTIFS('202'!$M:$M,E38,'202'!$P:$P,1),0)","v":0},{"$f":"IF('202'!$M$2=2,COUNTIFS('202'!$M:$M,E38,'202'!$P:$P,0),0)","v":0},{"$f":"IF('203'!$M$2=2,COUNTIFS('203'!$M:$M,E38,'203'!$P:$P,1),0)","v":0},{"$f":"IF('203'!$M$2=2,COUNTIFS('203'!$M:$M,E38,'203'!$P:$P,0),0)","v":0},{"$f":"IF('204'!$M$2=2,COUNTIFS('204'!$M:$M,E38,'204'!$P:$P,1),0)","v":0},{"$f":"IF('204'!$M$2=2,COUNTIFS('204'!$M:$M,E38,'204'!$P:$P,0),0)","v":0},{"$f":"IF('205'!$M$2=2,COUNTIFS('205'!$M:$M,E38,'205'!$P:$P,1),0)","v":0},{"$f":"IF('205'!$M$2=2,COUNTIFS('205'!$M:$M,E38,'205'!$P:$P,0),0)","v":0},null,0,null,{"$error":"#DIV/0!"}]
[7,4,28,null,"7 ∙ 4",{"$f":"IF('201'!$M$2=1,COUNTIFS('201'!$M:$M,E39,'201'!$P:$P,1),0)","v":0},{"$f":"IF('201'!$M$2=1,COUNTIFS('201'!$M:$M,E39,'201'!$P:$P,0),0)","v":0},{"$f":"IF('202'!$M$2=1,COUNTIFS('202'!$M:$M,E39,'202'!$P:$P,1),0)","v":0},{"$f":"IF('202'!$M$2=1,COUNTIFS('202'!$M:$M,E39,'202'!$P:$P,0),0)","v":0},{"$f":"IF('203'!$M$2=1,COUNTIFS('203'!$M:$M,E39,'203'!$P:$P,1),0)","v":0},{"$f":"IF('203'!$M$2=1,COUNTIFS('203'!$M:$M,E39,'203'!$P:$P,0),0)","v":0},{"$f":"IF('204'!$M$2=1,COUNTIFS('204'!$M:$M,E39,'204'!$P:$P,1),0)","v":0},{"$f":"IF('204'!$M$2=1,COUNTIFS('204'!$M:$M,E39,'204'!$P:$P,0),0)","v":0},{"$f":"IF('205'!$M$2=1,COUNTIFS('205'!$M:$M,E39,'205'!$P:$P,1),0)","v":0},{"$f":"IF('205'!$M$2=1,COUNTIFS('205'!$M:$M,E39,'205'!$P:$P,0),0)","v":0},null,0,null,{"$error":"#DIV/0!"},null,null,null,{"$f":"IF('201'!$M$2=2,COUNTIFS('201'!$M:$M,E39,'201'!$P:$P,1),0)","v":0},{"$f":"IF('201'!$M$2=2,COUNTIFS('201'!$M:$M,E39,'201'!$P:$P,0),0)","v":0},{"$f":"IF('202'!$M$2=2,COUNTIFS('202'!$M:$M,E39,'202'!$P:$P,1),0)","v":0},{"$f":"IF('202'!$M$2=2,COUNTIFS('202'!$M:$M,E39,'202'!$P:$P,0),0)","v":0},{"$f":"IF('203'!$M$2=2,COUNTIFS('203'!$M:$M,E39,'203'!$P:$P,1),0)","v":0},{"$f":"IF('203'!$M$2=2,COUNTIFS('203'!$M:$M,E39,'203'!$P:$P,0),0)","v":0},{"$f":"IF('204'!$M$2=2,COUNTIFS('204'!$M:$M,E39,'204'!$P:$P,1),0)","v":0},{"$f":"IF('204'!$M$2=2,COUNTIFS('204'!$M:$M,E39,'204'!$P:$P,0),0)","v":0},{"$f":"IF('205'!$M$2=2,COUNTIFS('205'!$M:$M,E39,'205'!$P:$P,1),0)","v":0},{"$f":"IF('205'!$M$2=2,COUNTIFS('205'!$M:$M,E39,'205'!$P:$P,0),0)","v":0},null,0,null,{"$error":"#DIV/0!"}]
[8,4,32,null,"8 ∙ 4",{"$f":"IF('201'!$M$2=1,COUNTIFS('201'!$M:$M,E40,'201'!$P:$P,1),0)","v":0},{"$f":"IF('201'!$M$2=1,COUNTIFS('201'!$M:$M,E40,'201'!$P:$P,0),0)","v":0},{"$f":"IF('202'!$M$2=1,COUNTIFS('202'!$M:$M,E40,'202'!$P:$P,1),0)","v":0},{"$f":"IF('202'!$M$2=1,COUNTIFS('202'!$M:$M,E40,'202'!$P:$P,0),0)","v":0},{"$f":"IF('203'!$M$2=1,COUNTIFS('203'!$M:$M,E40,'203'!$P:$P,1),0)","v":0},{"$f":"IF('203'!$M$2=1,COUNTIFS('203'!$M:$M,E40,'203'!$P:$P,0),0)","v":0},{"$f":"IF('204'!$M$2=1,COUNTIFS('204'!$M:$M,E40,'204'!$P:$P,1),0)","v":0},{"$f":"IF('204'!$M$2=1,COUNTIFS('204'!$M:$M,E40,'204'!$P:$P,0),0)","v":0},{"$f":"IF('205'!$M$2=1,COUNTIFS('205'!$M:$M,E40,'205'!$P:$P,1),0)","v":0},{"$f":"IF('205'!$M$2=1,COUNTIFS('205'!$M:$M,E40,'205'!$P:$P,0),0)","v":0},null,0,null,{"$error":"#DIV/0!"},null,null,null,{"$f":"IF('201'!$M$2=2,COUNTIFS('201'!$M:$M,E40,'201'!$P:$P,1),0)","v":0},{"$f":"IF('201'!$M$2=2,COUNTIFS('201'!$M:$M,E40,'201'!$P:$P,0),0)","v":0},{"$f":"IF('202'!$M$2=2,COUNTIFS('202'!$M:$M,E40,'202'!$P:$P,1),0)","v":0},{"$f":"IF('202'!$M$2=2,COUNTIFS('202'!$M:$M,E40,'202'!$P:$P,0),0)","v":0},{"$f":"IF('203'!$M$2=2,COUNTIFS('203'!$M:$M,E40,'203'!$P:$P,1),0)","v":0},{"$f":"IF('203'!$M$2=2,COUNTIFS('203'!$M:$M,E40,'203'!$P:$P,0),0)","v":0},{"$f":"IF('204'!$M$2=2,COUNTIFS('204'!$M:$M,E40,'204'!$P:$P,1),0)","v":0},{"$f":"IF('204'!$M$2=2,COUNTIFS('204'!$M:$M,E40,'204'!$P:$P,0),0)","v":0},{"$f":"IF('205'!$M$2=2,COUNTIFS('205'!$M:$M,E40,'205'!$P:$P,1),0)","v":0},{"$f":"IF('205'!$M$2=2,COUNTIFS('205'!$M:$M,E40,'205'!$P:$P,0),0)","v":0},null,0,null,{"$error":"#DIV/0!"}]
[9,4,36,null,"9 ∙ 4",{"$f":"IF('201'!$M$2=1,COUNTIFS('201'!$M:$M,E41,'201'!$P:$P,1),0)","v":0},{"$f":"IF('201'!$M$2=1,COUNTIFS('201'!$M:$M,E41,'201'!$P:$P,0),0)","v":0},{"$f":"IF('202'!$M$2=1,COUNTIFS('202'!$M:$M,E41,'202'!$P:$P,1),0)","v":0},{"$f":"IF('202'!$M$2=1,COUNTIFS('202'!$M:$M,E41,'202'!$P:$P,0),0)","v":0},{"$f":"IF('203'!$M$2=1,COUNTIFS('203'!$M:$M,E41,'203'!$P:$P,1),0)","v":0},{"$f":"IF('203'!$M$2=1,COUNTIFS('203'!$M:$M,E41,'203'!$P:$P,0),0)","v":0},{"$f":"IF('204'!$M$2=1,COUNTIFS('204'!$M:$M,E41,'204'!$P:$P,1),0)","v":0},{"$f":"IF('204'!$M$2=1,COUNTIFS('204'!$M:$M,E41,'204'!$P:$P,0),0)","v":0},{"$f":"IF('205'!$M$2=1,COUNTIFS('205'!$M:$M,E41,'205'!$P:$P,1),0)","v":0},{"$f":"IF('205'!$M$2=1,COUNTIFS('205'!$M:$M,E41,'205'!$P:$P,0),0)","v":0},null,0,null,{"$error":"#DIV/0!"},null,null,null,{"$f":"IF('201'!$M$2=2,COUNTIFS('201'!$M:$M,E41,'201'!$P:$P,1),0)","v":0},{"$f":"IF('201'!$M$2=2,COUNTIFS('201'!$M:$M,E41,'201'!$P:$P,0),0)","v":0},{"$f":"IF('202'!$M$2=2,COUNTIFS('202'!$M:$M,E41,'202'!$P:$P,1),0)","v":0},{"$f":"IF('202'!$M$2=2,COUNTIFS('202'!$M:$M,E41,'202'!$P:$P,0),0)","v":0},{"$f":"IF('203'!$M$2=2,COUNTIFS('203'!$M:$M,E41,'203'!$P:$P,1),0)","v":0},{"$f":"IF('203'!$M$2=2,COUNTIFS('203'!$M:$M,E41,'203'!$P:$P,0),0)","v":0},{"$f":"IF('204'!$M$2=2,COUNTIFS('204'!$M:$M,E41,'204'!$P:$P,1),0)","v":0},{"$f":"IF('204'!$M$2=2,COUNTIFS('204'!$M:$M,E41,'204'!$P:$P,0),0)","v":0},{"$f":"IF('205'!$M$2=2,COUNTIFS('205'!$M:$M,E41,'205'!$P:$P,1),0)","v":0},{"$f":"IF('205'!$M$2=2,COUNTIFS('205'!$M:$M,E41,'205'!$P:$P,0),0)","v":0},null,0,null,{"$error":"#DIV/0!"}]
[10,4,40,null,"10 ∙ 4",{"$f":"IF('201'!$M$2=1,COUNTIFS('201'!$M:$M,E42,'201'!$P:$P,1),0)","v":0},{"$f":"IF('201'!$M$2=1,COUNTIFS('201'!$M:$M,E42,'201'!$P:$P,0),0)","v":0},{"$f":"IF('202'!$M$2=1,COUNTIFS('202'!$M:$M,E42,'202'!$P:$P,1),0)","v":0},{"$f":"IF('202'!$M$2=1,COUNTIFS('202'!$M:$M,E42,'202'!$P:$P,0),0)","v":0},{"$f":"IF('203'!$M$2=1,COUNTIFS('203'!$M:$M,E42,'203'!$P:$P,1),0)","v":0},{"$f":"IF('203'!$M$2=1,COUNTIFS('203'!$M:$M,E42,'203'!$P:$P,0),0)","v":0},{"$f":"IF('204'!$M$2=1,COUNTIFS('204'!$M:$M,E42,'204'!$P:$P,1),0)","v":0},{"$f":"IF('204'!$M$2=1,COUNTIFS('204'!$M:$M,E42,'204'!$P:$P,0),0)","v":0},{"$f":"IF('205'!$M$2=1,COUNTIFS('205'!$M:$M,E42,'205'!$P:$P,1),0)","v":0},{"$f":"IF('205'!$M$2=1,COUNTIFS('205'!$M:$M,E42,'205'!$P:$P,0),0)","v":0},null,0,null,{"$error":"#DIV/0!"},null,null,null,{"$f":"IF('201'!$M$2=2,COUNTIFS('201'!$M:$M,E42,'201'!$P:$P,1),0)","v":0},{"$f":"IF('201'!$M$2=2,COUNTIFS('201'!$M:$M,E42,'201'!$P:$P,0),0)","v":0},{"$f":"IF('202'!$M$2=2,COUNTIFS('202'!$M:$M,E42,'202'!$P:$P,1),0)","v":0},{"$f":"IF('202'!$M$2=2,COUNTIFS('202'!$M:$M,E42,'202'!$P:$P,0),0)","v":0},{"$f":"IF('203'!$M$2=2,COUNTIFS('203'!$M:$M,E42,'203'!$P:$P,1),0)","v":0},{"$f":"IF('203'!$M$2=2,COUNTIFS('203'!$M:$M,E42,'203'!$P:$P,0),0)","v":0},{"$f":"IF('204'!$M$2=2,COUNTIFS('204'!$M:$M,E42,'204'!$P:$P,1),0)","v":0},{"$f":"IF('204'!$M$2=2,COUNTIFS('204'!$M:$M,E42,'204'!$P:$P,0),0)","v":0},{"$f":"IF('205'!$M$2=2,COUNTIFS('205'!$M:$M,E42,'205'!$P:$P,1),0)","v":0},{"$f":"IF('205'!$M$2=2,COUNTIFS('205'!$M:$M,E42,'205'!$P:$P,0),0)","v":0},null,0,null,{"$error":"#DIV/0!"}]
[1,5,5,null,"1 ∙ 5",{"$f":"IF('201'!$M$2=1,COUNTIFS('201'!$M:$M,E43,'201'!$P:$P,1),0)","v":0},{"$f":"IF('201'!$M$2=1,COUNTIFS('201'!$M:$M,E43,'201'!$P:$P,0),0)","v":0},{"$f":"IF('202'!$M$2=1,COUNTIFS('202'!$M:$M,E43,'202'!$P:$P,1),0)","v":0},{"$f":"IF('202'!$M$2=1,COUNTIFS('202'!$M:$M,E43,'202'!$P:$P,0),0)","v":0},{"$f":"IF('203'!$M$2=1,COUNTIFS('203'!$M:$M,E43,'203'!$P:$P,1),0)","v":0},{"$f":"IF('203'!$M$2=1,COUNTIFS('203'!$M:$M,E43,'203'!$P:$P,0),0)","v":0},{"$f":"IF('204'!$M$2=1,COUNTIFS('204'!$M:$M,E43,'204'!$P:$P,1),0)","v":0},{"$f":"IF('204'!$M$2=1,COUNTIFS('204'!$M:$M,E43,'204'!$P:$P,0),0)","v":0},{"$f":"IF('205'!$M$2=1,COUNTIFS('205'!$M:$M,E43,'205'!$P:$P,1),0)","v":0},{"$f":"IF('205'!$M$2=1,COUNTIFS('205'!$M:$M,E43,'205'!$P:$P,0),0)","v":0},null,0,null,{"$error":"#DIV/0!"},null,null,null,{"$f":"IF('201'!$M$2=2,COUNTIFS('201'!$M:$M,E43,'201'!$P:$P,1),0)","v":0},{"$f":"IF('201'!$M$2=2,COUNTIFS('201'!$M:$M,E43,'201'!$P:$P,0),0)","v":0},{"$f":"IF('202'!$M$2=2,COUNTIFS('202'!$M:$M,E43,'202'!$P:$P,1),0)","v":0},{"$f":"IF('202'!$M$2=2,COUNTIFS('202'!$M:$M,E43,'202'!$P:$P,0),0)","v":0},{"$f":"IF('203'!$M$2=2,COUNTIFS('203'!$M:$M,E43,'203'!$P:$P,1),0)","v":0},{"$f":"IF('203'!$M$2=2,COUNTIFS('203'!$M:$M,E43,'203'!$P:$P,0),0)","v":0},{"$f":"IF('204'!$M$2=2,COUNTIFS('204'!$M:$M,E43,'204'!$P:$P,1),0)","v":0},{"$f":"IF('204'!$M$2=2,COUNTIFS('204'!$M:$M,E43,'204'!$P:$P,0),0)","v":0},{"$f":"IF('205'!$M$2=2,COUNTIFS('205'!$M:$M,E43,'205'!$P:$P,1),0)","v":0},{"$f":"IF('205'!$M$2=2,COUNTIFS('205'!$M:$M,E43,'205'!$P:$P,0),0)","v":0},null,0,null,{"$error":"#DIV/0!"}]
[2,5,10,null,"2 ∙ 5",{"$f":"IF('201'!$M$2=1,COUNTIFS('201'!$M:$M,E44,'201'!$P:$P,1),0)","v":0},{"$f":"IF('201'!$M$2=1,COUNTIFS('201'!$M:$M,E44,'201'!$P:$P,0),0)","v":0},{"$f":"IF('202'!$M$2=1,COUNTIFS('202'!$M:$M,E44,'202'!$P:$P,1),0)","v":0},{"$f":"IF('202'!$M$2=1,COUNTIFS('202'!$M:$M,E44,'202'!$P:$P,0),0)","v":0},{"$f":"IF('203'!$M$2=1,COUNTIFS('203'!$M:$M,E44,'203'!$P:$P,1),0)","v":0},{"$f":"IF('203'!$M$2=1,COUNTIFS('203'!$M:$M,E44,'203'!$P:$P,0),0)","v":0},{"$f":"IF('204'!$M$2=1,COUNTIFS('204'!$M:$M,E44,'204'!$P:$P,1),0)","v":0},{"$f":"IF('204'!$M$2=1,COUNTIFS('204'!$M:$M,E44,'204'!$P:$P,0),0)","v":0},{"$f":"IF('205'!$M$2=1,COUNTIFS('205'!$M:$M,E44,'205'!$P:$P,1),0)","v":0},{"$f":"IF('205'!$M$2=1,COUNTIFS('205'!$M:$M,E44,'205'!$P:$P,0),0)","v":0},null,0,null,{"$error":"#DIV/0!"},null,null,null,{"$f":"IF('201'!$M$2=2,COUNTIFS('201'!$M:$M,E44,'201'!$P:$P,1),0)","v":0},{"$f":"IF('201'!$M$2=2,COUNTIFS('201'!$M:$M,E44,'201'!$P:$P,0),0)","v":0},{"$f":"IF('202'!$M$2=2,COUNTIFS('202'!$M:$M,E44,'202'!$P:$P,1),0)","v":0},{"$f":"IF('202'!$M$2=2,COUNTIFS('202'!$M:$M,E44,'202'!$P:$P,0),0)","v":0},{"$f":"IF('203'!$M$2=2,COUNTIFS('203'!$M:$M,E44,'203'!$P:$P,1),0)","v":0},{"$f":"IF('203'!$M$2=2,COUNTIFS('203'!$M:$M,E44,'203'!$P:$P,0),0)","v":0},{"$f":"IF('204'!$M$2=2,COUNTIFS('204'!$M:$M,E44,'204'!$P:$P,1),0)","v":0},{"$f":"IF('204'!$M$2=2,COUNTIFS('204'!$M:$M,E44,'204'!$P:$P,0),0)","v":0},{"$f":"IF('205'!$M$2=2,COUNTIFS('205'!$M:$M,E44,'205'!$P:$P,1),0)","v":0},{"$f":"IF('205'!$M$2=2,COUNTIFS('205'!$M:$M,E44,'205'!$P:$P,0),0)","v":0},null,0,null,{"$error":"#DIV/0!"}]
[3,5,15,null,"3 ∙ 5",{"$f":"IF('201'!$M$2=1,COUNTIFS('201'!$M:$M,E45,'201'!$P:$P,1),0)","v":0},{"$f":"IF('201'!$M$2=1,COUNTIFS('201'!$M:$M,E45,'201'!$P:$P,0),0)","v":0},{"$f":"IF('202'!$M$2=1,COUNTIFS('202'!$M:$M,E45,'202'!$P:$P,1),0)","v":0},{"$f":"IF('202'!$M$2=1,COUNTIFS('202'!$M:$M,E45,'202'!$P:$P,0),0)","v":0},{"$f":"IF('203'!$M$2=1,COUNTIFS('203'!$M:$M,E45,'203'!$P:$P,1),0)","v":0},{"$f":"IF('203'!$M$2=1,COUNTIFS('203'!$M:$M,E45,'203'!$P:$P,0),0)","v":0},{"$f":"IF('204'!$M$2=1,COUNTIFS('204'!$M:$M,E45,'204'!$P:$P,1),0)","v":0},{"$f":"IF('204'!$M$2=1,COUNTIFS('204'!$M:$M,E45,'204'!$P:$P,0),0)","v":0},{"$f":"IF('205'!$M$2=1,COUNTIFS('205'!$M:$M,E45,'205'!$P:$P,1),0)","v":0},{"$f":"IF('205'!$M$2=1,COUNTIFS('205'!$M:$M,E45,'205'!$P:$P,0),0)","v":0},null,0,null,{"$error":"#DIV/0!"},null,null,null,{"$f":"IF('201'!$M$2=2,COUNTIFS('201'!$M:$M,E45,'201'!$P:$P,1),0)","v":0},{"$f":"IF('201'!$M$2=2,COUNTIFS('201'!$M:$M,E45,'201'!$P:$P,0),0)","v":0},{"$f":"IF('202'!$M$2=2,COUNTIFS('202'!$M:$M,E45,'202'!$P:$P,1),0)","v":0},{"$f":"IF('202'!$M$2=2,COUNTIFS('202'!$M:$M,E45,'202'!$P:$P,0),0)","v":0},{"$f":"IF('203'!$M$2=2,COUNTIFS('203'!$M:$M,E45,'203'!$P:$P,1),0)","v":0},{"$f":"IF('203'!$M$2=2,COUNTIFS('203'!$M:$M,E45,'203'!$P:$P,0),0)","v":0},{"$f":"IF('204'!$M$2=2,COUNTIFS('204'!$M:$M,E45,'204'!$P:$P,1),0)","v":0},{"$f":"IF('204'!$M$2=2,COUNTIFS('204'!$M:$M,E45,'204'!$P:$P,0),0)","v":0},{"$f":"IF('205'!$M$2=2,COUNTIFS('205'!$M:$M,E45,'205'!$P:$P,1),0)","v":0},{"$f":"IF('205'!$M$2=2,COUNTIFS('205'!$M:$M,E45,'205'!$P:$P,0),0)","v":0},null,0,null,{"$error":"#DIV/0!"}]
[4,5,20,null,"4 ∙ 5",{"$f":"IF('201'!$M$2=1,COUNTIFS('201'!$M:$M,E46,'201'!$P:$P,1),0)","v":0},{"$f":"IF('201'!$M$2=1,COUNTIFS('201'!$M:$M,E46,'201'!$P:$P,0),0)","v":0},{"$f":"IF('202'!$M$2=1,COUNTIFS('202'!$M:$M,E46,'202'!$P:$P,1),0)","v":0},{"$f":"IF('202'!$M$2=1,COUNTIFS('202'!$M:$M,E46,'202'!$P:$P,0),0)","v":0},{"$f":"IF('203'!$M$2=1,COUNTIFS('203'!$M:$M,E46,'203'!$P:$P,1),0)","v":0},{"$f":"IF('203'!$M$2=1,COUNTIFS('203'!$M:$M,E46,'203'!$P:$P,0),0)","v":0},{"$f":"IF('204'!$M$2=1,COUNTIFS('204'!$M:$M,E46,'204'!$P:$P,1),0)","v":0},{"$f":"IF('204'!$M$2=1,COUNTIFS('204'!$M:$M,E46,'204'!$P:$P,0),0)","v":0},{"$f":"IF('205'!$M$2=1,COUNTIFS('205'!$M:$M,E46,'205'!$P:$P,1),0)","v":0},{"$f":"IF('205'!$M$2=1,COUNTIFS('205'!$M:$M,E46,'205'!$P:$P,0),0)","v":0},null,0,null,{"$error":"#DIV/0!"},null,null,null,{"$f":"IF('201'!$M$2=2,COUNTIFS('201'!$M:$M,E46,'201'!$P:$P,1),0)","v":0},{"$f":"IF('201'!$M$2=2,COUNTIFS('201'!$M:$M,E46,'201'!$P:$P,0),0)","v":0},{"$f":"IF('202'!$M$2=2,COUNTIFS('202'!$M:$M,E46,'202'!$P:$P,1),0)","v":0},{"$f":"IF('202'!$M$2=2,COUNTIFS('202'!$M:$M,E46,'202'!$P:$P,0),0)","v":0},{"$f":"IF('203'!$M$2=2,COUNTIFS('203'!$M:$M,E46,'203'!$P:$P,1),0)","v":0},{"$f":"IF('203'!$M$2=2,COUNTIFS('203'!$M:$M,E46,'203'!$P:$P,0),0)","v":0},{"$f":"IF('204'!$M$2=2,COUNTIFS('204'!$M:$M,E46,'204'!$P:$P,1),0)","v":0},{"$f":"IF('204'!$M$2=2,COUNTIFS('204'!$M:$M,E46,'204'!$P:$P,0),0)","v":0},{"$f":"IF('205'!$M$2=2,COUNTIFS('205'!$M:$M,E46,'205'!$P:$P,1),0)","v":0},{"$f":"IF('205'!$M$2=2,COUNTIFS('205'!$M:$M,E46,'205'!$P:$P,0),0)","v":0},null,0,null,{"$error":"#DIV/0!"}]
[5,5,25,null,"5 ∙ 5",{"$f":"IF('201'!$M$2=1,COUNTIFS('201'!$M:$M,E47,'201'!$P:$P,1),0)","v":0},{"$f":"IF('201'!$M$2=1,COUNTIFS('201'!$M:$M,E47,'201'!$P:$P,0),0)","v":0},{"$f":"IF('202'!$M$2=1,COUNTIFS('202'!$M:$M,E47,'202'!$P:$P,1),0)","v":0},{"$f":"IF('202'!$M$2=1,COUNTIFS('202'!$M:$M,E47,'202'!$P:$P,0),0)","v":0},{"$f":"IF('203'!$M$2=1,COUNTIFS('203'!$M:$M,E47,'203'!$P:$P,1),0)","v":0},{"$f":"IF('203'!$M$2=1,COUNTIFS('203'!$M:$M,E47,'203'!$P:$P,0),0)","v":0},{"$f":"IF('204'!$M$2=1,COUNTIFS('204'!$M:$M,E47,'204'!$P:$P,1),0)","v":0},{"$f":"IF('204'!$M$2=1,COUNTIFS('204'!$M:$M,E47,'204'!$P:$P,0),0)","v":0},{"$f":"IF('205'!$M$2=1,COUNTIFS('205'!$M:$M,E47,'205'!$P:$P,1),0)","v":0},{"$f":"IF('205'!$M$2=1,COUNTIFS('205'!$M:$M,E47,'205'!$P:$P,0),0)","v":0},null,0,null,{"$error":"#DIV/0!"},null,null,null,{"$f":"IF('201'!$M$2=2,COUNTIFS('201'!$M:$M,E47,'201'!$P:$P,1),0)","v":0},{"$f":"IF('201'!$M$2=2,COUNTIFS('201'!$M:$M,E47,'201'!$P:$P,0),0)","v":0},{"$f":"IF('202'!$M$2=2,COUNTIFS('202'!$M:$M,E47,'202'!$P:$P,1),0)","v":0},{"$f":"IF('202'!$M$2=2,COUNTIFS('202'!$M:$M,E47,'202'!$P:$P,0),0)","v":0},{"$f":"IF('203'!$M$2=2,COUNTIFS('203'!$M:$M,E47,'203'!$P:$P,1),0)","v":0},{"$f":"IF('203'!$M$2=2,COUNTIFS('203'!$M:$M,E47,'203'!$P:$P,0),0)","v":0},{"$f":"IF('204'!$M$2=2,COUNTIFS('204'!$M:$M,E47,'204'!$P:$P,1),0)","v":0},{"$f":"IF('204'!$M$2=2,COUNTIFS('204'!$M:$M,E47,'204'!$P:$P,0),0)","v":0},{"$f":"IF('205'!$M$2=2,COUNTIFS('205'!$M:$M,E47,'205'!$P:$P,1),0)","v":0},{"$f":"IF('205'!$M$2=2,COUNTIFS('205'!$M:$M,E47,'205'!$P:$P,0),0)","v":0},null,0,null,{"$error":"#DIV/0!"}]
[6,5,30,null,"6 ∙ 5",{"$f":"IF('201'!$M$2=1,COUNTIFS('201'!$M:$M,E48,'201'!$P:$P,1),0)","v":0},{"$f":"IF('201'!$M$2=1,COUNTIFS('201'!$M:$M,E48,'201'!$P:$P,0),0)","v":0},{"$f":"IF('202'!$M$2=1,COUNTIFS('202'!$M:$M,E48,'202'!$P:$P,1),0)","v":0},{"$f":"IF('202'!$M$2=1,COUNTIFS('202'!$M:$M,E48,'202'!$P:$P,0),0)","v":0},{"$f":"IF('203'!$M$2=1,COUNTIFS('203'!$M:$M,E48,'203'!$P:$P,1),0)","v":0},{"$f":"IF('203'!$M$2=1,COUNTIFS('203'!$M:$M,E48,'203'!$P:$P,0),0)","v":0},{"$f":"IF('204'!$M$2=1,COUNTIFS('204'!$M:$M,E48,'204'!$P:$P,1),0)","v":0},{"$f":"IF('204'!$M$2=1,COUNTIFS('204'!$M:$M,E48,'204'!$P:$P,0),0)","v":0},{"$f":"IF('205'!$M$2=1,COUNTIFS('205'!$M:$M,E48,'205'!$P:$P,1),0)","v":0},{"$f":"IF('205'!$M$2=1,COUNTIFS('205'!$M:$M,E48,'205'!$P:$P,0),0)","v":0},null,0,null,{"$error":"#DIV/0!"},null,null,null,{"$f":"IF('201'!$M$2=2,COUNTIFS('201'!$M:$M,E48,'201'!$P:$P,1),0)","v":0},{"$f":"IF('201'!$M$2=2,COUNTIFS('201'!$M:$M,E48,'201'!$P:$P,0),0)","v":0},{"$f":"IF('202'!$M$2=2,COUNTIFS('202'!$M:$M,E48,'202'!$P:$P,1),0)","v":0},{"$f":"IF('202'!$M$2=2,COUNTIFS('202'!$M:$M,E48,'202'!$P:$P,0),0)","v":0},{"$f":"IF('203'!$M$2=2,COUNTIFS('203'!$M:$M,E48,'203'!$P:$P,1),0)","v":0},{"$f":"IF('203'!$M$2=2,COUNTIFS('203'!$M:$M,E48,'203'!$P:$P,0),0)","v":0},{"$f":"IF('204'!$M$2=2,COUNTIFS('204'!$M:$M,E48,'204'!$P:$P,1),0)","v":0},{"$f":"IF('204'!$M$2=2,COUNTIFS('204'!$M:$M,E48,'204'!$P:$P,0),0)","v":0},{"$f":"IF('205'!$M$2=2,COUNTIFS('205'!$M:$M,E48,'205'!$P:$P,1),0)","v":0},{"$f":"IF('205'!$M$2=2,COUNTIFS('205'!$M:$M,E48,'205'!$P:$P,0),0)","v":0},null,0,null,{"$error":"#DIV/0!"}]
[7,5,35,null,"7 ∙ 5",{"$f":"IF('201'!$M$2=1,COUNTIFS('201'!$M:$M,E49,'201'!$P:$P,1),0)","v":0},{"$f":"IF('201'!$M$2=1,COUNTIFS('201'!$M:$M,E49,'201'!$P:$P,0),0)","v":0},{"$f":"IF('202'!$M$2=1,COUNTIFS('202'!$M:$M,E49,'202'!$P:$P,1),0)","v":0},{"$f":"IF('202'!$M$2=1,COUNTIFS('202'!$M:$M,E49,'202'!$P:$P,0),0)","v":0},{"$f":"IF('203'!$M$2=1,COUNTIFS('203'!$M:$M,E49,'203'!$P:$P,1),0)","v":0},{"$f":"IF('203'!$M$2=1,COUNTIFS('203'!$M:$M,E49,'203'!$P:$P,0),0)","v":0},{"$f":"IF('204'!$M$2=1,COUNTIFS('204'!$M:$M,E49,'204'!$P:$P,1),0)","v":0},{"$f":"IF('204'!$M$2=1,COUNTIFS('204'!$M:$M,E49,'204'!$P:$P,0),0)","v":0},{"$f":"IF('205'!$M$2=1,COUNTIFS('205'!$M:$M,E49,'205'!$P:$P,1),0)","v":0},{"$f":"IF('205'!$M$2=1,COUNTIFS('205'!$M:$M,E49,'205'!$P:$P,0),0)","v":0},null,0,null,{"$error":"#DIV/0!"},null,null,null,{"$f":"IF('201'!$M$2=2,COUNTIFS('201'!$M:$M,E49,'201'!$P:$P,1),0)","v":0},{"$f":"IF('201'!$M$2=2,COUNTIFS('201'!$M:$M,E49,'201'!$P:$P,0),0)","v":0},{"$f":"IF('202'!$M$2=2,COUNTIFS('202'!$M:$M,E49,'202'!$P:$P,1),0)","v":0},{"$f":"IF('202'!$M$2=2,COUNTIFS('202'!$M:$M,E49,'202'!$P:$P,0),0)","v":0},{"$f":"IF('203'!$M$2=2,COUNTIFS('203'!$M:$M,E49,'203'!$P:$P,1),0)","v":0},{"$f":"IF('203'!$M$2=2,COUNTIFS('203'!$M:$M,E49,'203'!$P:$P,0),0)","v":0},{"$f":"IF('204'!$M$2=2,COUNTIFS('204'!$M:$M,E49,'204'!$P:$P,1),0)","v":0},{"$f":"IF('204'!$M$2=2,COUNTIFS('204'!$M:$M,E49,'204'!$P:$P,0),0)","v":0},{"$f":"IF('205'!$M$2=2,COUNTIFS('205'!$M:$M,E49,'205'!$P:$P,1),0)","v":0},{"$f":"IF('205'!$M$2=2,COUNTIFS('205'!$M:$M,E49,'205'!$P:$P,0),0)","v":0},null,0,null,{"$error":"#DIV/0!"}]
[8,5,40,null,"8 ∙ 5",{"$f":"IF('201'!$M$2=1,COUNTIFS('201'!$M:$M,E50,'201'!$P:$P,1),0)","v":0},{"$f":"IF('201'!$M$2=1,COUNTIFS('201'!$M:$M,E50,'201'!$P:$P,0),0)","v":0},{"$f":"IF('202'!$M$2=1,COUNTIFS('202'!$M:$M,E50,'202'!$P:$P,1),0)","v":0},{"$f":"IF('202'!$M$2=1,COUNTIFS('202'!$M:$M,E50,'202'!$P:$P,0),0)","v":0},{"$f":"IF('203'!$M$2=1,COUNTIFS('203'!$M:$M,E50,'203'!$P:$P,1),0)","v":0},{"$f":"IF('203'!$M$2=1,COUNTIFS('203'!$M:$M,E50,'203'!$P:$P,0),0)","v":0},{"$f":"IF('204'!$M$2=1,COUNTIFS('204'!$M:$M,E50,'204'!$P:$P,1),0)","v":0},{"$f":"IF('204'!$M$2=1,COUNTIFS('204'!$M:$M,E50,'204'!$P:$P,0),0)","v":0},{"$f":"IF('205'!$M$2=1,COUNTIFS('205'!$M:$M,E50,'205'!$P:$P,1),0)","v":0},{"$f":"IF('205'!$M$2=1,COUNTIFS('205'!$M:$M,E50,'205'!$P:$P,0),0)","v":0},null,0,null,{"$error":"#DIV/0!"},null,null,null,{"$f":"IF('201'!$M$2=2,COUNTIFS('201'!$M:$M,E50,'201'!$P:$P,1),0)","v":0},{"$f":"IF('201'!$M$2=2,COUNTIFS('201'!$M:$M,E50,'201'!$P:$P,0),0)","v":0},{"$f":"IF('202'!$M$2=2,COUNTIFS('202'!$M:$M,E50,'202'!$P:$P,1),0)","v":0},{"$f":"IF('202'!$M$2=2,COUNTIFS('202'!$M:$M,E50,'202'!$P:$P,0),0)","v":0},{"$f":"IF('203'!$M$2=2,COUNTIFS('203'!$M:$M,E50,'203'!$P:$P,1),0)","v":0},{"$f":"IF('203'!$M$2=2,COUNTIFS('203'!$M:$M,E50,'203'!$P:$P,0),0)","v":0},{"$f":"IF('204'!$M$2=2,COUNTIFS('204'!$M:$M,E50,'204'!$P:$P,1),0)","v":0},{"$f":"IF('204'!$M$2=2,COUNTIFS('204'!$M:$M,E50,'204'!$P:$P,0),0)","v":0},{"$f":"IF('205'!$M$2=2,COUNTIFS('205'!$M:$M,E50,'205'!$P:$P,1),0)","v":0},{"$f":"IF('205'!$M$2=2,COUNTIFS('205'!$M:$M,E50,'205'!$P:$P,0),0)","v":0},null,0,null,{"$error":"#DIV/0!"}]
[9,5,45,null,"9 ∙ 5",{"$f":"IF('201'!$M$2=1,COUNTIFS('201'!$M:$M,E51,'201'!$P:$P,1),0)","v":0},{"$f":"IF('201'!$M$2=1,COUNTIFS('201'!$M:$M,E51,'201'!$P:$P,0),0)","v":0},{"$f":"IF('202'!$M$2=1,COUNTIFS('202'!$M:$M,E51,'202'!$P:$P,1),0)","v":0},{"$f":"IF('202'!$M$2=1,COUNTIFS('202'!$M:$M,E51,'202'!$P:$P,0),0)","v":0},{"$f":"IF('203'!$M$2=1,COUNTIFS('203'!$M:$M,E51,'203'!$P:$P,1),0)","v":0},{"$f":"IF('203'!$M$2=1,COUNTIFS('203'!$M:$M,E51,'203'!$P:$P,0),0)","v":0},{"$f":"IF('204'!$M$2=1,COUNTIFS('204'!$M:$M,E51,'204'!$P:$P,1),0)","v":0},{"$f":"IF('204'!$M$2=1,COUNTIFS('204'!$M:$M,E51,'204'!$P:$P,0),0)","v":0},{"$f":"IF('205'!$M$2=1,COUNTIFS('205'!$M:$M,E51,'205'!$P:$P,1),0)","v":0},{"$f":"IF('205'!$M$2=1,COUNTIFS('205'!$M:$M,E51,'205'!$P:$P,0),0)","v":0},null,0,null,{"$error":"#DIV/0!"},null,null,null,{"$f":"IF('201'!$M$2=2,COUNTIFS('201'!$M:$M,E51,'201'!$P:$P,1),0)","v":0},{"$f":"IF('201'!$M$2=2,COUNTIFS('201'!$M:$M,E51,'201'!$P:$P,0),0)","v":0},{"$f":"IF('202'!$M$2=2,COUNTIFS('202'!$M:$M,E51,'202'!$P:$P,1),0)","v":0},{"$f":"IF('202'!$M$2=2,COUNTIFS('202'!$M:$M,E51,'202'!$P:$P,0),0)","v":0},{"$f":"IF('203'!$M$2=2,COUNTIFS('203'!$M:$M,E51,'203'!$P:$P,1),0)","v":0},{"$f":"IF('203'!$M$2=2,COUNTIFS('203'!$M:$M,E51,'203'!$P:$P,0),0)","v":0},{"$f":"IF('204'!$M$2=2,COUNTIFS('204'!$M:$M,E51,'204'!$P:$P,1),0)","v":0},{"$f":"IF('204'!$M$2=2,COUNTIFS('204'!$M:$M,E51,'204'!$P:$P,0),0)","v":0},{"$f":"IF('205'!$M$2=2,COUNTIFS('205'!$M:$M,E51,'205'!$P:$P,1),0)","v":0},{"$f":"IF('205'!$M$2=2,COUNTIFS('205'!$M:$M,E51,'205'!$P:$P,0),0)","v":0},null,0,null,{"$error":"#DIV/0!"}]
[10,5,50,null,"10 ∙ 5",{"$f":"IF('201'!$M$2=1,COUNTIFS('201'!$M:$M,E52,'201'!$P:$P,1),0)","v":0},{"$f":"IF('201'!$M$2=1,COUNTIFS('201'!$M:$M,E52,'201'!$P:$P,0),0)","v":0},{"$f":"IF('202'!$M$2=1,COUNTIFS('202'!$M:$M,E52,'202'!$P:$P,1),0)","v":0},{"$f":"IF('202'!$M$2=1,COUNTIFS('202'!$M:$M,E52,'202'!$P:$P,0),0)","v":0},{"$f":"IF('203'!$M$2=1,COUNTIFS('203'!$M:$M,E52,'203'!$P:$P,1),0)","v":0},{"$f":"IF('203'!$M$2=1,COUNTIFS('203'!$M:$M,E52,'203'!$P:$P,0),0)","v":0},{"$f":"IF('204'!$M$2=1,COUNTIFS('204'!$M:$M,E52,'204'!$P:$P,1),0)","v":0},{"$f":"IF('204'!$M$2=1,COUNTIFS('204'!$M:$M,E52,'204'!$P:$P,0),0)","v":0},{"$f":"IF('205'!$M$2=1,COUNTIFS('205'!$M:$M,E52,'205'!$P:$P,1),0)","v":0},{"$f":"IF('205'!$M$2=1,COUNTIFS('205'!$M:$M,E52,'205'!$P:$P,0),0)","v":0},null,0,null,{"$error":"#DIV/0!"},null,null,null,{"$f":"IF('201'!$M$2=2,COUNTIFS('201'!$M:$M,E52,'201'!$P:$P,1),0)","v":0},{"$f":"IF('201'!$M$2=2,COUNTIFS('201'!$M:$M,E52,'201'!$P:$P,0),0)","v":0},{"$f":"IF('202'!$M$2=2,COUNTIFS('202'!$M:$M,E52,'202'!$P:$P,1),0)","v":0},{"$f":"IF('202'!$M$2=2,COUNTIFS('202'!$M:$M,E52,'202'!$P:$P,0),0)","v":0},{"$f":"IF('203'!$M$2=2,COUNTIFS('203'!$M:$M,E52,'203'!$P:$P,1),0)","v":0},{"$f":"IF('203'!$M$2=2,COUNTIFS('203'!$M:$M,E52,'203'!$P:$P,0),0)","v":0},{"$f":"IF('204'!$M$2=2,COUNTIFS('204'!$M:$M,E52,'204'!$P:$P,1),0)","v":0},{"$f":"IF('204'!$M$2=2,COUNTIFS('204'!$M:$M,E52,'204'!$P:$P,0),0)","v":0},{"$f":"IF('205'!$M$2=2,COUNTIFS('205'!$M:$M,E52,'205'!$P:$P,1),0)","v":0},{"$f":"IF('205'!$M$2=2,COUNTIFS('205'!$M:$M,E52,'205'!$P:$P,0),0)","v":0},null,0,null,{"$error":"#DIV/0!"}]
[1,6,6,null,"1 ∙ 6",{"$f":"IF('201'!$M$2=1,COUNTIFS('201'!$M:$M,E53,'201'!$P:$P,1),0)","v":0},{"$f":"IF('201'!$M$2=1,COUNTIFS('201'!$M:$M,E53,'201'!$P:$P,0),0)","v":0},{"$f":"IF('202'!$M$2=1,COUNTIFS('202'!$M:$M,E53,'202'!$P:$P,1),0)","v":0},{"$f":"IF('202'!$M$2=1,COUNTIFS('202'!$M:$M,E53,'202'!$P:$P,0),0)","v":0},{"$f":"IF('203'!$M$2=1,COUNTIFS('203'!$M:$M,E53,'203'!$P:$P,1),0)","v":0},{"$f":"IF('203'!$M$2=1,COUNTIFS('203'!$M:$M,E53,'203'!$P:$P,0),0)","v":0},{"$f":"IF('204'!$M$2=1,COUNTIFS('204'!$M:$M,E53,'204'!$P:$P,1),0)","v":0},{"$f":"IF('204'!$M$2=1,COUNTIFS('204'!$M:$M,E53,'204'!$P:$P,0),0)","v":0},{"$f":"IF('205'!$M$2=1,COUNTIFS('205'!$M:$M,E53,'205'!$P:$P,1),0)","v":0},{"$f":"IF('205'!$M$2=1,COUNTIFS('205'!$M:$M,E53,'205'!$P:$P,0),0)","v":0},null,0,null,{"$error":"#DIV/0!"},null,null,null,{"$f":"IF('201'!$M$2=2,COUNTIFS('201'!$M:$M,E53,'201'!$P:$P,1),0)","v":0},{"$f":"IF('201'!$M$2=2,COUNTIFS('201'!$M:$M,E53,'201'!$P:$P,0),0)","v":0},{"$f":"IF('202'!$M$2=2,COUNTIFS('202'!$M:$M,E53,'202'!$P:$P,1),0)","v":0},{"$f":"IF('202'!$M$2=2,COUNTIFS('202'!$M:$M,E53,'202'!$P:$P,0),0)","v":0},{"$f":"IF('203'!$M$2=2,COUNTIFS('203'!$M:$M,E53,'203'!$P:$P,1),0)","v":0},{"$f":"IF('203'!$M$2=2,COUNTIFS('203'!$M:$M,E53,'203'!$P:$P,0),0)","v":0},{"$f":"IF('204'!$M$2=2,COUNTIFS('204'!$M:$M,E53,'204'!$P:$P,1),0)","v":0},{"$f":"IF('204'!$M$2=2,COUNTIFS('204'!$M:$M,E53,'204'!$P:$P,0),0)","v":0},{"$f":"IF('205'!$M$2=2,COUNTIFS('205'!$M:$M,E53,'205'!$P:$P,1),0)","v":0},{"$f":"IF('205'!$M$2=2,COUNTIFS('205'!$M:$M,E53,'205'!$P:$P,0),0)","v":0},null,0,null,{"$error":"#DIV/0!"}]
[2,6,12,null,"2 ∙ 6",{"$f":"IF('201'!$M$2=1,COUNTIFS('201'!$M:$M,E54,'201'!$P:$P,1),0)","v":0},{"$f":"IF('201'!$M$2=1,COUNTIFS('201'!$M:$M,E54,'201'!$P:$P,0),0)","v":0},{"$f":"IF('202'!$M$2=1,COUNTIFS('202'!$M:$M,E54,'202'!$P:$P,1),0)","v":0},{"$f":"IF('202'!$M$2=1,COUNTIFS('202'!$M:$M,E54,'202'!$P:$P,0),0)","v":0},{"$f":"IF('203'!$M$2=1,COUNTIFS('203'!$M:$M,E54,'203'!$P:$P,1),0)","v":0},{"$f":"IF('203'!$M$2=1,COUNTIFS('203'!$M:$M,E54,'203'!$P:$P,0),0)","v":0},{"$f":"IF('204'!$M$2=1,COUNTIFS('204'!$M:$M,E54,'204'!$P:$P,1),0)","v":0},{"$f":"IF('204'!$M$2=1,COUNTIFS('204'!$M:$M,E54,'204'!$P:$P,0),0)","v":0},{"$f":"IF('205'!$M$2=1,COUNTIFS('205'!$M:$M,E54,'205'!$P:$P,1),0)","v":0},{"$f":"IF('205'!$M$2=1,COUNTIFS('205'!$M:$M,E54,'205'!$P:$P,0),0)","v":0},null,0,null,{"$error":"#DIV/0!"},null,null,null,{"$f":"IF('201'!$M$2=2,COUNTIFS('201'!$M:$M,E54,'201'!$P:$P,1),0)","v":0},{"$f":"IF('201'!$M$2=2,COUNTIFS('201'!$M:$M,E54,'201'!$P:$P,0),0)","v":0},{"$f":"IF('202'!$M$2=2,COUNTIFS('202'!$M:$M,E54,'202'!$P:$P,1),0)","v":0},{"$f":"IF('202'!$M$2=2,COUNTIFS('202'!$M:$M,E54,'202'!$P:$P,0),0)","v":0},{"$f":"IF('203'!$M$2=2,COUNTIFS('203'!$M:$M,E54,'203'!$P:$P,1),0)","v":0},{"$f":"IF('203'!$M$2=2,COUNTIFS('203'!$M:$M,E54,'203'!$P:$P,0),0)","v":0},{"$f":"IF('204'!$M$2=2,COUNTIFS('204'!$M:$M,E54,'204'!$P:$P,1),0)","v":0},{"$f":"IF('204'!$M$2=2,COUNTIFS('204'!$M:$M,E54,'204'!$P:$P,0),0)","v":0},{"$f":"IF('205'!$M$2=2,COUNTIFS('205'!$M:$M,E54,'205'!$P:$P,1),0)","v":0},{"$f":"IF('205'!$M$2=2,COUNTIFS('205'!$M:$M,E54,'205'!$P:$P,0),0)","v":0},null,0,null,{"$error":"#DIV/0!"}]
[3,6,18,null,"3 ∙ 6",{"$f":"IF('201'!$M$2=1,COUNTIFS('201'!$M:$M,E55,'201'!$P:$P,1),0)","v":0},{"$f":"IF('201'!$M$2=1,COUNTIFS('201'!$M:$M,E55,'201'!$P:$P,0),0)","v":0},{"$f":"IF('202'!$M$2=1,COUNTIFS('202'!$M:$M,E55,'202'!$P:$P,1),0)","v":0},{"$f":"IF('202'!$M$2=1,COUNTIFS('202'!$M:$M,E55,'202'!$P:$P,0),0)","v":0},{"$f":"IF('203'!$M$2=1,COUNTIFS('203'!$M:$M,E55,'203'!$P:$P,1),0)","v":0},{"$f":"IF('203'!$M$2=1,COUNTIFS('203'!$M:$M,E55,'203'!$P:$P,0),0)","v":0},{"$f":"IF('204'!$M$2=1,COUNTIFS('204'!$M:$M,E55,'204'!$P:$P,1),0)","v":0},{"$f":"IF('204'!$M$2=1,COUNTIFS('204'!$M:$M,E55,'204'!$P:$P,0),0)","v":0},{"$f":"IF('205'!$M$2=1,COUNTIFS('205'!$M:$M,E55,'205'!$P:$P,1),0)","v":0},{"$f":"IF('205'!$M$2=1,COUNTIFS('205'!$M:$M,E55,'205'!$P:$P,0),0)","v":0},null,0,null,{"$error":"#DIV/0!"},null,null,null,{"$f":"IF('201'!$M$2=2,COUNTIFS('201'!$M:$M,E55,'201'!$P:$P,1),0)","v":0},{"$f":"IF('201'!$M$2=2,COUNTIFS('201'!$M:$M,E55,'201'!$P:$P,0),0)","v":0},{"$f":"IF('202'!$M$2=2,COUNTIFS('202'!$M:$M,E55,'202'!$P:$P,1),0)","v":0},{"$f":"IF('202'!$M$2=2,COUNTIFS('202'!$M:$M,E55,'202'!$P:$P,0),0)","v":0},{"$f":"IF('203'!$M$2=2,COUNTIFS('203'!$M:$M,E55,'203'!$P:$P,1),0)","v":0},{"$f":"IF('203'!$M$2=2,COUNTIFS('203'!$M:$M,E55,'203'!$P:$P,0),0)","v":0},{"$f":"IF('204'!$M$2=2,COUNTIFS('204'!$M:$M,E55,'204'!$P:$P,1),0)","v":0},{"$f":"IF('204'!$M$2=2,COUNTIFS('204'!$M:$M,E55,'204'!$P:$P,0),0)","v":0},{"$f":"IF('205'!$M$2=2,COUNTIFS('205'!$M:$M,E55,'205'!$P:$P,1),0)","v":0},{"$f":"IF('205'!$M$2=2,COUNTIFS('205'!$M:$M,E55,'205'!$P:$P,0),0)","v":0},null,0,null,{"$error":"#DIV/0!"}]
[4,6,24,null,"4 ∙ 6",{"$f":"IF('201'!$M$2=1,COUNTIFS('201'!$M:$M,E56,'201'!$P:$P,1),0)","v":0},{"$f":"IF('201'!$M$2=1,COUNTIFS('201'!$M:$M,E56,'201'!$P:$P,0),0)","v":0},{"$f":"IF('202'!$M$2=1,COUNTIFS('202'!$M:$M,E56,'202'!$P:$P,1),0)","v":0},{"$f":"IF('202'!$M$2=1,COUNTIFS('202'!$M:$M,E56,'202'!$P:$P,0),0)","v":0},{"$f":"IF('203'!$M$2=1,COUNTIFS('203'!$M:$M,E56,'203'!$P:$P,1),0)","v":0},{"$f":"IF('203'!$M$2=1,COUNTIFS('203'!$M:$M,E56,'203'!$P:$P,0),0)","v":0},{"$f":"IF('204'!$M$2=1,COUNTIFS('204'!$M:$M,E56,'204'!$P:$P,1),0)","v":0},{"$f":"IF('204'!$M$2=1,COUNTIFS('204'!$M:$M,E56,'204'!$P:$P,0),0)","v":0},{"$f":"IF('205'!$M$2=1,COUNTIFS('205'!$M:$M,E56,'205'!$P:$P,1),0)","v":0},{"$f":"IF('205'!$M$2=1,COUNTIFS('205'!$M:$M,E56,'205'!$P:$P,0),0)","v":0},null,0,null,{"$error":"#DIV/0!"},null,null,null,{"$f":"IF('201'!$M$2=2,COUNTIFS('201'!$M:$M,E56,'201'!$P:$P,1),0)","v":0},{"$f":"IF('201'!$M$2=2,COUNTIFS('201'!$M:$M,E56,'201'!$P:$P,0),0)","v":0},{"$f":"IF('202'!$M$2=2,COUNTIFS('202'!$M:$M,E56,'202'!$P:$P,1),0)","v":0},{"$f":"IF('202'!$M$2=2,COUNTIFS('202'!$M:$M,E56,'202'!$P:$P,0),0)","v":0},{"$f":"IF('203'!$M$2=2,COUNTIFS('203'!$M:$M,E56,'203'!$P:$P,1),0)","v":0},{"$f":"IF('203'!$M$2=2,COUNTIFS('203'!$M:$M,E56,'203'!$P:$P,0),0)","v":0},{"$f":"IF('204'!$M$2=2,COUNTIFS('204'!$M:$M,E56,'204'!$P:$P,1),0)","v":0},{"$f":"IF('204'!$M$2=2,COUNTIFS('204'!$M:$M,E56,'204'!$P:$P,0),0)","v":0},{"$f":"IF('205'!$M$2=2,COUNTIFS('205'!$M:$M,E56,'205'!$P:$P,1),0)","v":0},{"$f":"IF('205'!$M$2=2,COUNTIFS('205'!$M:$M,E56,'205'!$P:$P,0),0)","v":0},null,0,null,{"$error":"#DIV/0!"}]
[5,6,30,null,"5 ∙ 6",{"$f":"IF('201'!$M$2=1,COUNTIFS('201'!$M:$M,E57,'201'!$P:$P,1),0)","v":0},{"$f":"IF('201'!$M$2=1,COUNTIFS('201'!$M:$M,E57,'201'!$P:$P,0),0)","v":0},{"$f":"IF('202'!$M$2=1,COUNTIFS('202'!$M:$M,E57,'202'!$P:$P,1),0)","v":0},{"$f":"IF('202'!$M$2=1,COUNTIFS('202'!$M:$M,E57,'202'!$P:$P,0),0)","v":0},{"$f":"IF('203'!$M$2=1,COUNTIFS('203'!$M:$M,E57,'203'!$P:$P,1),0)","v":0},{"$f":"IF('203'!$M$2=1,COUNTIFS('203'!$M:$M,E57,'203'!$P:$P,0),0)","v":0},{"$f":"IF('204'!$M$2=1,COUNTIFS('204'!$M:$M,E57,'204'!$P:$P,1),0)","v":0},{"$f":"IF('204'!$M$2=1,COUNTIFS('204'!$M:$M,E57,'204'!$P:$P,0),0)","v":0},{"$f":"IF('205'!$M$2=1,COUNTIFS('205'!$M:$M,E57,'205'!$P:$P,1),0)","v":0},{"$f":"IF('205'!$M$2=1,COUNTIFS('205'!$M:$M,E57,'205'!$P:$P,0),0)","v":0},null,0,null,{"$error":"#DIV/0!"},null,null,null,{"$f":"IF('201'!$M$2=2,COUNTIFS('201'!$M:$M,E57,'201'!$P:$P,1),0)","v":0},{"$f":"IF('201'!$M$2=2,COUNTIFS('201'!$M:$M,E57,'201'!$P:$P,0),0)","v":0},{"$f":"IF('202'!$M$2=2,COUNTIFS('202'!$M:$M,E57,'202'!$P:$P,1),0)","v":0},{"$f":"IF('202'!$M$2=2,COUNTIFS('202'!$M:$M,E57,'202'!$P:$P,0),0)","v":0},{"$f":"IF('203'!$M$2=2,COUNTIFS('203'!$M:$M,E57,'203'!$P:$P,1),0)","v":0},{"$f":"IF('203'!$M$2=2,COUNTIFS('203'!$M:$M,E57,'203'!$P:$P,0),0)","v":0},{"$f":"IF('204'!$M$2=2,COUNTIFS('204'!$M:$M,E57,'204'!$P:$P,1),0)","v":0},{"$f":"IF('204'!$M$2=2,COUNTIFS('204'!$M:$M,E57,'204'!$P:$P,0),0)","v":0},{"$f":"IF('205'!$M$2=2,COUNTIFS('205'!$M:$M,E57,'205'!$P:$P,1),0)","v":0},{"$f":"IF('205'!$M$2=2,COUNTIFS('205'!$M:$M,E57,'205'!$P:$P,0),0)","v":0},null,0,null,{"$error":"#DIV/0!"}]
[6,6,36,null,"6 ∙ 6",{"$f":"IF('201'!$M$2=1,COUNTIFS('201'!$M:$M,E58,'201'!$P:$P,1),0)","v":0},{"$f":"IF('201'!$M$2=1,COUNTIFS('201'!$M:$M,E58,'201'!$P:$P,0),0)","v":0},{"$f":"IF('202'!$M$2=1,COUNTIFS('202'!$M:$M,E58,'202'!$P:$P,1),0)","v":0},{"$f":"IF('202'!$M$2=1,COUNTIFS('202'!$M:$M,E58,'202'!$P:$P,0),0)","v":0},{"$f":"IF('203'!$M$2=1,COUNTIFS('203'!$M:$M,E58,'203'!$P:$P,1),0)","v":0},{"$f":"IF('203'!$M$2=1,COUNTIFS('203'!$M:$M,E58,'203'!$P:$P,0),0)","v":0},{"$f":"IF('204'!$M$2=1,COUNTIFS('204'!$M:$M,E58,'204'!$P:$P,1),0)","v":0},{"$f":"IF('204'!$M$2=1,COUNTIFS('204'!$M:$M,E58,'204'!$P:$P,0),0)","v":0},{"$f":"IF('205'!$M$2=1,COUNTIFS('205'!$M:$M,E58,'205'!$P:$P,1),0)","v":0},{"$f":"IF('205'!$M$2=1,COUNTIFS('205'!$M:$M,E58,'205'!$P:$P,0),0)","v":0},null,0,null,{"$error":"#DIV/0!"},null,null,null,{"$f":"IF('201'!$M$2=2,COUNTIFS('201'!$M:$M,E58,'201'!$P:$P,1),0)","v":0},{"$f":"IF('201'!$M$2=2,COUNTIFS('201'!$M:$M,E58,'201'!$P:$P,0),0)","v":0},{"$f":"IF('202'!$M$2=2,COUNTIFS('202'!$M:$M,E58,'202'!$P:$P,1),0)","v":0},{"$f":"IF('202'!$M$2=2,COUNTIFS('202'!$M:$M,E58,'202'!$P:$P,0),0)","v":0},{"$f":"IF('203'!$M$2=2,COUNTIFS('203'!$M:$M,E58,'203'!$P:$P,1),0)","v":0},{"$f":"IF('203'!$M$2=2,COUNTIFS('203'!$M:$M,E58,'203'!$P:$P,0),0)","v":0},{"$f":"IF('204'!$M$2=2,COUNTIFS('204'!$M:$M,E58,'204'!$P:$P,1),0)","v":0},{"$f":"IF('204'!$M$2=2,COUNTIFS('204'!$M:$M,E58,'204'!$P:$P,0),0)","v":0},{"$f":"IF('205'!$M$2=2,COUNTIFS('205'!$M:$M,E58,'205'!$P:$P,1),0)","v":0},{"$f":"IF('205'!$M$2=2,COUNTIFS('205'!$M:$M,E58,'205'!$P:$P,0),0)","v":0},null,0,null,{"$error":"#DIV/0!"}]
[7,6,42,null,"7 ∙ 6",{"$f":"IF('201'!$M$2=1,COUNTIFS('201'!$M:$M,E59,'201'!$P:$P,1),0)","v":0},{"$f":"IF('201'!$M$2=1,COUNTIFS('201'!$M:$M,E59,'201'!$P:$P,0),0)","v":0},{"$f":"IF('202'!$M$2=1,COUNTIFS('202'!$M:$M,E59,'202'!$P:$P,1),0)","v":0},{"$f":"IF('202'!$M$2=1,COUNTIFS('202'!$M:$M,E59,'202'!$P:$P,0),0)","v":0},{"$f":"IF('203'!$M$2=1,COUNTIFS('203'!$M:$M,E59,'203'!$P:$P,1),0)","v":0},{"$f":"IF('203'!$M$2=1,COUNTIFS('203'!$M:$M,E59,'203'!$P:$P,0),0)","v":0},{"$f":"IF('204'!$M$2=1,COUNTIFS('204'!$M:$M,E59,'204'!$P:$P,1),0)","v":0},{"$f":"IF('204'!$M$2=1,COUNTIFS('204'!$M:$M,E59,'204'!$P:$P,0),0)","v":0},{"$f":"IF('205'!$M$2=1,COUNTIFS('205'!$M:$M,E59,'205'!$P:$P,1),0)","v":0},{"$f":"IF('205'!$M$2=1,COUNTIFS('205'!$M:$M,E59,'205'!$P:$P,0),0)","v":0},null,0,null,{"$error":"#DIV/0!"},null,null,null,{"$f":"IF('201'!$M$2=2,COUNTIFS('201'!$M:$M,E59,'201'!$P:$P,1),0)","v":0},{"$f":"IF('201'!$M$2=2,COUNTIFS('201'!$M:$M,E59,'201'!$P:$P,0),0)","v":0},{"$f":"IF('202'!$M$2=2,COUNTIFS('202'!$M:$M,E59,'202'!$P:$P,1),0)","v":0},{"$f":"IF('202'!$M$2=2,COUNTIFS('202'!$M:$M,E59,'202'!$P:$P,0),0)","v":0},{"$f":"IF('203'!$M$2=2,COUNTIFS('203'!$M:$M,E59,'203'!$P:$P,1),0)","v":0},{"$f":"IF('203'!$M$2=2,COUNTIFS('203'!$M:$M,E59,'203'!$P:$P,0),0)","v":0},{"$f":"IF('204'!$M$2=2,COUNTIFS('204'!$M:$M,E59,'204'!$P:$P,1),0)","v":0},{"$f":"IF('204'!$M$2=2,COUNTIFS('204'!$M:$M,E59,'204'!$P:$P,0),0)","v":0},{"$f":"IF('205'!$M$2=2,COUNTIFS('205'!$M:$M,E59,'205'!$P:$P,1),0)","v":0},{"$f":"IF('205'!$M$2=2,COUNTIFS('205'!$M:$M,E59,'205'!$P:$P,0),0)","v":0},null,0,null,{"$error":"#DIV/0!"}]
[8,6,48,null,"8 ∙ 6",{"$f":"IF('201'!$M$2=1,COUNTIFS('201'!$M:$M,E60,'201'!$P:$P,1),0)","v":0},{"$f":"IF('201'!$M$2=1,COUNTIFS('201'!$M:$M,E60,'201'!$P:$P,0),0)","v":0},{"$f":"IF('202'!$M$2=1,COUNTIFS('202'!$M:$M,E60,'202'!$P:$P,1),0)","v":0},{"$f":"IF('202'!$M$2=1,COUNTIFS('202'!$M:$M,E60,'202'!$P:$P,0),0)","v":0},{"$f":"IF('203'!$M$2=1,COUNTIFS('203'!$M:$M,E60,'203'!$P:$P,1),0)","v":0},{"$f":"IF('203'!$M$2=1,COUNTIFS('203'!$M:$M,E60,'203'!$P:$P,0),0)","v":0},{"$f":"IF('204'!$M$2=1,COUNTIFS('204'!$M:$M,E60,'204'!$P:$P,1),0)","v":0},{"$f":"IF('204'!$M$2=1,COUNTIFS('204'!$M:$M,E60,'204'!$P:$P,0),0)","v":0},{"$f":"IF('205'!$M$2=1,COUNTIFS('205'!$M:$M,E60,'205'!$P:$P,1),0)","v":0},{"$f":"IF('205'!$M$2=1,COUNTIFS('205'!$M:$M,E60,'205'!$P:$P,0),0)","v":0},null,0,null,{"$error":"#DIV/0!"},null,null,null,{"$f":"IF('201'!$M$2=2,COUNTIFS('201'!$M:$M,E60,'201'!$P:$P,1),0)","v":0},{"$f":"IF('201'!$M$2=2,COUNTIFS('201'!$M:$M,E60,'201'!$P:$P,0),0)","v":0},{"$f":"IF('202'!$M$2=2,COUNTIFS('202'!$M:$M,E60,'202'!$P:$P,1),0)","v":0},{"$f":"IF('202'!$M$2=2,COUNTIFS('202'!$M:$M,E60,'202'!$P:$P,0),0)","v":0},{"$f":"IF('203'!$M$2=2,COUNTIFS('203'!$M:$M,E60,'203'!$P:$P,1),0)","v":0},{"$f":"IF('203'!$M$2=2,COUNTIFS('203'!$M:$M,E60,'203'!$P:$P,0),0)","v":0},{"$f":"IF('204'!$M$2=2,COUNTIFS('204'!$M:$M,E60,'204'!$P:$P,1),0)","v":0},{"$f":"IF('204'!$M$2=2,COUNTIFS('204'!$M:$M,E60,'204'!$P:$P,0),0)","v":0},{"$f":"IF('205'!$M$2=2,COUNTIFS('205'!$M:$M,E60,'205'!$P:$P,1),0)","v":0},{"$f":"IF('205'!$M$2=2,COUNTIFS('205'!$M:$M,E60,'205'!$P:$P,0),0)","v":0},null,0,null,{"$error":"#DIV/0!"}]
[9,6,54,null,"9 ∙ 6",{"$f":"IF('201'!$M$2=1,COUNTIFS('201'!$M:$M,E61,'201'!$P:$P,1),0)","v":0},{"$f":"IF('201'!$M$2=1,COUNTIFS('201'!$M:$M,E61,'201'!$P:$P,0),0)","v":0},{"$f":"IF('202'!$M$2=1,COUNTIFS('202'!$M:$M,E61,'202'!$P:$P,1),0)","v":0},{"$f":"IF('202'!$M$2=1,COUNTIFS('202'!$M:$M,E61,'202'!$P:$P,0),0)","v":0},{"$f":"IF('203'!$M$2=1,COUNTIFS('203'!$M:$M,E61,'203'!$P:$P,1),0)","v":0},{"$f":"IF('203'!$M$2=1,COUNTIFS('203'!$M:$M,E61,'203'!$P:$P,0),0)","v":0},{"$f":"IF('204'!$M$2=1,COUNTIFS('204'!$M:$M,E61,'204'!$P:$P,1),0)","v":0},{"$f":"IF('204'!$M$2=1,COUNTIFS('204'!$M:$M,E61,'204'!$P:$P,0),0)","v":0},{"$f":"IF('205'!$M$2=1,COUNTIFS('205'!$M:$M,E61,'205'!$P:$P,1),0)","v":0},{"$f":"IF('205'!$M$2=1,COUNTIFS('205'!$M:$M,E61,'205'!$P:$P,0),0)","v":0},null,0,null,{"$error":"#DIV/0!"},null,null,null,{"$f":"IF('201'!$M$2=2,COUNTIFS('201'!$M:$M,E61,'201'!$P:$P,1),0)","v":0},{"$f":"IF('201'!$M$2=2,COUNTIFS('201'!$M:$M,E61,'201'!$P:$P,0),0)","v":0},{"$f":"IF('202'!$M$2=2,COUNTIFS('202'!$M:$M,E61,'202'!$P:$P,1),0)","v":0},{"$f":"IF('202'!$M$2=2,COUNTIFS('202'!$M:$M,E61,'202'!$P:$P,0),0)","v":0},{"$f":"IF('203'!$M$2=2,COUNTIFS('203'!$M:$M,E61,'203'!$P:$P,1),0)","v":0},{"$f":"IF('203'!$M$2=2,COUNTIFS('203'!$M:$M,E61,'203'!$P:$P,0),0)","v":0},{"$f":"IF('204'!$M$2=2,COUNTIFS('204'!$M:$M,E61,'204'!$P:$P,1),0)","v":0},{"$f":"IF('204'!$M$2=2,COUNTIFS('204'!$M:$M,E61,'204'!$P:$P,0),0)","v":0},{"$f":"IF('205'!$M$2=2,COUNTIFS('205'!$M:$M,E61,'205'!$P:$P,1),0)","v":0},{"$f":"IF('205'!$M$2=2,COUNTIFS('205'!$M:$M,E61,'205'!$P:$P,0),0)","v":0},null,0,null,{"$error":"#DIV/0!"}]
[10,6,60,null,"10 ∙ 6",{"$f":"IF('201'!$M$2=1,COUNTIFS('201'!$M:$M,E62,'201'!$P:$P,1),0)","v":0},{"$f":"IF('201'!$M$2=1,COUNTIFS('201'!$M:$M,E62,'201'!$P:$P,0),0)","v":0},{"$f":"IF('202'!$M$2=1,COUNTIFS('202'!$M:$M,E62,'202'!$P:$P,1),0)","v":0},{"$f":"IF('202'!$M$2=1,COUNTIFS('202'!$M:$M,E62,'202'!$P:$P,0),0)","v":0},{"$f":"IF('203'!$M$2=1,COUNTIFS('203'!$M:$M,E62,'203'!$P:$P,1),0)","v":0},{"$f":"IF('203'!$M$2=1,COUNTIFS('203'!$M:$M,E62,'203'!$P:$P,0),0)","v":0},{"$f":"IF('204'!$M$2=1,COUNTIFS('204'!$M:$M,E62,'204'!$P:$P,1),0)","v":0},{"$f":"IF('204'!$M$2=1,COUNTIFS('204'!$M:$M,E62,'204'!$P:$P,0),0)","v":0},{"$f":"IF('205'!$M$2=1,COUNTIFS('205'!$M:$M,E62,'205'!$P:$P,1),0)","v":0},{"$f":"IF('205'!$M$2=1,COUNTIFS('205'!$M:$M,E62,'205'!$P:$P,0),0)","v":0},null,0,null,{"$error":"#DIV/0!"},null,null,null,{"$f":"IF('201'!$M$2=2,COUNTIFS('201'!$M:$M,E62,'201'!$P:$P,1),0)","v":0},{"$f":"IF('201'!$M$2=2,COUNTIFS('201'!$M:$M,E62,'201'!$P:$P,0),0)","v":0},{"$f":"IF('202'!$M$2=2,COUNTIFS('202'!$M:$M,E62,'202'!$P:$P,1),0)","v":0},{"$f":"IF('202'!$M$2=2,COUNTIFS('202'!$M:$M,E62,'202'!$P:$P,0),0)","v":0},{"$f":"IF('203'!$M$2=2,COUNTIFS('203'!$M:$M,E62,'203'!$P:$P,1),0)","v":0},{"$f":"IF('203'!$M$2=2,COUNTIFS('203'!$M:$M,E62,'203'!$P:$P,0),0)","v":0},{"$f":"IF('204'!$M$2=2,COUNTIFS('204'!$M:$M,E62,'204'!$P:$P,1),0)","v":0},{"$f":"IF('204'!$M$2=2,COUNTIFS('204'!$M:$M,E62,'204'!$P:$P,0),0)","v":0},{"$f":"IF('205'!$M$2=2,COUNTIFS('205'!$M:$M,E62,'205'!$P:$P,1),0)","v":0},{"$f":"IF('205'!$M$2=2,COUNTIFS('205'!$M:$M,E62,'205'!$P:$P,0),0)","v":0},null,0,null,{"$error":"#DIV/0!"}]
[1,7,7,null,"1 ∙ 7",{"$f":"IF('201'!$M$2=1,COUNTIFS('201'!$M:$M,E63,'201'!$P:$P,1),0)","v":0},{"$f":"IF('201'!$M$2=1,COUNTIFS('201'!$M:$M,E63,'201'!$P:$P,0),0)","v":0},{"$f":"IF('202'!$M$2=1,COUNTIFS('202'!$M:$M,E63,'202'!$P:$P,1),0)","v":0},{"$f":"IF('202'!$M$2=1,COUNTIFS('202'!$M:$M,E63,'202'!$P:$P,0),0)","v":0},{"$f":"IF('203'!$M$2=1,COUNTIFS('203'!$M:$M,E63,'203'!$P:$P,1),0)","v":0},{"$f":"IF('203'!$M$2=1,COUNTIFS('203'!$M:$M,E63,'203'!$P:$P,0),0)","v":0},{"$f":"IF('204'!$M$2=1,COUNTIFS('204'!$M:$M,E63,'204'!$P:$P,1),0)","v":0},{"$f":"IF('204'!$M$2=1,COUNTIFS('204'!$M:$M,E63,'204'!$P:$P,0),0)","v":0},{"$f":"IF('205'!$M$2=1,COUNTIFS('205'!$M:$M,E63,'205'!$P:$P,1),0)","v":0},{"$f":"IF('205'!$M$2=1,COUNTIFS('205'!$M:$M,E63,'205'!$P:$P,0),0)","v":0},null,0,null,{"$error":"#DIV/0!"},null,null,null,{"$f":"IF('201'!$M$2=2,COUNTIFS('201'!$M:$M,E63,'201'!$P:$P,1),0)","v":0},{"$f":"IF('201'!$M$2=2,COUNTIFS('201'!$M:$M,E63,'201'!$P:$P,0),0)","v":0},{"$f":"IF('202'!$M$2=2,COUNTIFS('202'!$M:$M,E63,'202'!$P:$P,1),0)","v":0},{"$f":"IF('202'!$M$2=2,COUNTIFS('202'!$M:$M,E63,'202'!$P:$P,0),0)","v":0},{"$f":"IF('203'!$M$2=2,COUNTIFS('203'!$M:$M,E63,'203'!$P:$P,1),0)","v":0},{"$f":"IF('203'!$M$2=2,COUNTIFS('203'!$M:$M,E63,'203'!$P:$P,0),0)","v":0},{"$f":"IF('204'!$M$2=2,COUNTIFS('204'!$M:$M,E63,'204'!$P:$P,1),0)","v":0},{"$f":"IF('204'!$M$2=2,COUNTIFS('204'!$M:$M,E63,'204'!$P:$P,0),0)","v":0},{"$f":"IF('205'!$M$2=2,COUNTIFS('205'!$M:$M,E63,'205'!$P:$P,1),0)","v":0},{"$f":"IF('205'!$M$2=2,COUNTIFS('205'!$M:$M,E63,'205'!$P:$P,0),0)","v":0},null,0,null,{"$error":"#DIV/0!"}]
[2,7,14,null,"2 ∙ 7",{"$f":"IF('201'!$M$2=1,COUNTIFS('201'!$M:$M,E64,'201'!$P:$P,1),0)","v":0},{"$f":"IF('201'!$M$2=1,COUNTIFS('201'!$M:$M,E64,'201'!$P:$P,0),0)","v":0},{"$f":"IF('202'!$M$2=1,COUNTIFS('202'!$M:$M,E64,'202'!$P:$P,1),0)","v":0},{"$f":"IF('202'!$M$2=1,COUNTIFS('202'!$M:$M,E64,'202'!$P:$P,0),0)","v":0},{"$f":"IF('203'!$M$2=1,COUNTIFS('203'!$M:$M,E64,'203'!$P:$P,1),0)","v":0},{"$f":"IF('203'!$M$2=1,COUNTIFS('203'!$M:$M,E64,'203'!$P:$P,0),0)","v":0},{"$f":"IF('204'!$M$2=1,COUNTIFS('204'!$M:$M,E64,'204'!$P:$P,1),0)","v":0},{"$f":"IF('204'!$M$2=1,COUNTIFS('204'!$M:$M,E64,'204'!$P:$P,0),0)","v":0},{"$f":"IF('205'!$M$2=1,COUNTIFS('205'!$M:$M,E64,'205'!$P:$P,1),0)","v":0},{"$f":"IF('205'!$M$2=1,COUNTIFS('205'!$M:$M,E64,'205'!$P:$P,0),0)","v":0},null,0,null,{"$error":"#DIV/0!"},null,null,null,{"$f":"IF('201'!$M$2=2,COUNTIFS('201'!$M:$M,E64,'201'!$P:$P,1),0)","v":0},{"$f":"IF('201'!$M$2=2,COUNTIFS('201'!$M:$M,E64,'201'!$P:$P,0),0)","v":0},{"$f":"IF('202'!$M$2=2,COUNTIFS('202'!$M:$M,E64,'202'!$P:$P,1),0)","v":0},{"$f":"IF('202'!$M$2=2,COUNTIFS('202'!$M:$M,E64,'202'!$P:$P,0),0)","v":0},{"$f":"IF('203'!$M$2=2,COUNTIFS('203'!$M:$M,E64,'203'!$P:$P,1),0)","v":0},{"$f":"IF('203'!$M$2=2,COUNTIFS('203'!$M:$M,E64,'203'!$P:$P,0),0)","v":0},{"$f":"IF('204'!$M$2=2,COUNTIFS('204'!$M:$M,E64,'204'!$P:$P,1),0)","v":0},{"$f":"IF('204'!$M$2=2,COUNTIFS('204'!$M:$M,E64,'204'!$P:$P,0),0)","v":0},{"$f":"IF('205'!$M$2=2,COUNTIFS('205'!$M:$M,E64,'205'!$P:$P,1),0)","v":0},{"$f":"IF('205'!$M$2=2,COUNTIFS('205'!$M:$M,E64,'205'!$P:$P,0),0)","v":0},null,0,null,{"$error":"#DIV/0!"}]
[3,7,21,null,"3 ∙ 7",{"$f":"IF('201'!$M$2=1,COUNTIFS('201'!$M:$M,E65,'201'!$P:$P,1),0)","v":0},{"$f":"IF('201'!$M$2=1,COUNTIFS('201'!$M:$M,E65,'201'!$P:$P,0),0)","v":0},{"$f":"IF('202'!$M$2=1,COUNTIFS('202'!$M:$M,E65,'202'!$P:$P,1),0)","v":0},{"$f":"IF('202'!$M$2=1,COUNTIFS('202'!$M:$M,E65,'202'!$P:$P,0),0)","v":0},{"$f":"IF('203'!$M$2=1,COUNTIFS('203'!$M:$M,E65,'203'!$P:$P,1),0)","v":0},{"$f":"IF('203'!$M$2=1,COUNTIFS('203'!$M:$M,E65,'203'!$P:$P,0),0)","v":0},{"$f":"IF('204'!$M$2=1,COUNTIFS('204'!$M:$M,E65,'204'!$P:$P,1),0)","v":0},{"$f":"IF('204'!$M$2=1,COUNTIFS('204'!$M:$M,E65,'204'!$P:$P,0),0)","v":0},{"$f":"IF('205'!$M$2=1,COUNTIFS('205'!$M:$M,E65,'205'!$P:$P,1),0)","v":0},{"$f":"IF('205'!$M$2=1,COUNTIFS('205'!$M:$M,E65,'205'!$P:$P,0),0)","v":0},null,0,null,{"$error":"#DIV/0!"},null,null,null,{"$f":"IF('201'!$M$2=2,COUNTIFS('201'!$M:$M,E65,'201'!$P:$P,1),0)","v":0},{"$f":"IF('201'!$M$2=2,COUNTIFS('201'!$M:$M,E65,'201'!$P:$P,0),0)","v":0},{"$f":"IF('202'!$M$2=2,COUNTIFS('202'!$M:$M,E65,'202'!$P:$P,1),0)","v":0},{"$f":"IF('202'!$M$2=2,COUNTIFS('202'!$M:$M,E65,'202'!$P:$P,0),0)","v":0},{"$f":"IF('203'!$M$2=2,COUNTIFS('203'!$M:$M,E65,'203'!$P:$P,1),0)","v":0},{"$f":"IF('203'!$M$2=2,COUNTIFS('203'!$M:$M,E65,'203'!$P:$P,0),0)","v":0},{"$f":"IF('204'!$M$2=2,COUNTIFS('204'!$M:$M,E65,'204'!$P:$P,1),0)","v":0},{"$f":"IF('204'!$M$2=2,COUNTIFS('204'!$M:$M,E65,'204'!$P:$P,0),0)","v":0},{"$f":"IF('205'!$M$2=2,COUNTIFS('205'!$M:$M,E65,'205'!$P:$P,1),0)","v":0},{"$f":"IF('205'!$M$2=2,COUNTIFS('205'!$M:$M,E65,'205'!$P:$P,0),0)","v":0},null,0,null,{"$error":"#DIV/0!"}]
[4,7,28,null,"4 ∙ 7",{"$f":"IF('201'!$M$2=1,COUNTIFS('201'!$M:$M,E66,'201'!$P:$P,1),0)","v":0},{"$f":"IF('201'!$M$2=1,COUNTIFS('201'!$M:$M,E66,'201'!$P:$P,0),0)","v":0},{"$f":"IF('202'!$M$2=1,COUNTIFS('202'!$M:$M,E66,'202'!$P:$P,1),0)","v":0},{"$f":"IF('202'!$M$2=1,COUNTIFS('202'!$M:$M,E66,'202'!$P:$P,0),0)","v":0},{"$f":"IF('203'!$M$2=1,COUNTIFS('203'!$M:$M,E66,'203'!$P:$P,1),0)","v":0},{"$f":"IF('203'!$M$2=1,COUNTIFS('203'!$M:$M,E66,'203'!$P:$P,0),0)","v":0},{"$f":"IF('204'!$M$2=1,COUNTIFS('204'!$M:$M,E66,'204'!$P:$P,1),0)","v":0},{"$f":"IF('204'!$M$2=1,COUNTIFS('204'!$M:$M,E66,'204'!$P:$P,0),0)","v":0},{"$f":"IF('205'!$M$2=1,COUNTIFS('205'!$M:$M,E66,'205'!$P:$P,1),0)","v":0},{"$f":"IF('205'!$M$2=1,COUNTIFS('205'!$M:$M,E66,'205'!$P:$P,0),0)","v":0},null,0,null,{"$error":"#DIV/0!"},null,null,null,{"$f":"IF('201'!$M$2=2,COUNTIFS('201'!$M:$M,E66,'201'!$P:$P,1),0)","v":0},{"$f":"IF('201'!$M$2=2,COUNTIFS('201'!$M:$M,E66,'201'!$P:$P,0),0)","v":0},{"$f":"IF('202'!$M$2=2,COUNTIFS('202'!$M:$M,E66,'202'!$P:$P,1),0)","v":0},{"$f":"IF('202'!$M$2=2,COUNTIFS('202'!$M:$M,E66,'202'!$P:$P,0),0)","v":0},{"$f":"IF('203'!$M$2=2,COUNTIFS('203'!$M:$M,E66,'203'!$P:$P,1),0)","v":0},{"$f":"IF('203'!$M$2=2,COUNTIFS('203'!$M:$M,E66,'203'!$P:$P,0),0)","v":0},{"$f":"IF('204'!$M$2=2,COUNTIFS('204'!$M:$M,E66,'204'!$P:$P,1),0)","v":0},{"$f":"IF('204'!$M$2=2,COUNTIFS('204'!$M:$M,E66,'204'!$P:$P,0),0)","v":0},{"$f":"IF('205'!$M$2=2,COUNTIFS('205'!$M:$M,E66,'205'!$P:$P,1),0)","v":0},{"$f":"IF('205'!$M$2=2,COUNTIFS('205'!$M:$M,E66,'205'!$P:$P,0),0)","v":0},null,0,null,{"$error":"#DIV/0!"}]
[5,7,35,null,"5 ∙ 7",{"$f":"IF('201'!$M$2=1,COUNTIFS('201'!$M:$M,E67,'201'!$P:$P,1),0)","v":0},{"$f":"IF('201'!$M$2=1,COUNTIFS('201'!$M:$M,E67,'201'!$P:$P,0),0)","v":0},{"$f":"IF('202'!$M$2=1,COUNTIFS('202'!$M:$M,E67,'202'!$P:$P,1),0)","v":0},{"$f":"IF('202'!$M$2=1,COUNTIFS('202'!$M:$M,E67,'202'!$P:$P,0),0)","v":0},{"$f":"IF('203'!$M$2=1,COUNTIFS('203'!$M:$M,E67,'203'!$P:$P,1),0)","v":0},{"$f":"IF('203'!$M$2=1,COUNTIFS('203'!$M:$M,E67,'203'!$P:$P,0),0)","v":0},{"$f":"IF('204'!$M$2=1,COUNTIFS('204'!$M:$M,E67,'204'!$P:$P,1),0)","v":0},{"$f":"IF('204'!$M$2=1,COUNTIFS('204'!$M:$M,E67,'204'!$P:$P,0),0)","v":0},{"$f":"IF('205'!$M$2=1,COUNTIFS('205'!$M:$M,E67,'205'!$P:$P,1),0)","v":0},{"$f":"IF('205'!$M$2=1,COUNTIFS('205'!$M:$M,E67,'205'!$P:$P,0),0)","v":0},null,{"$f":"SUM(F67:O67)","v":0},null,{"$f":"SUM(F67,H67,J67,L67,N67)/Q67","v":{"$error":"#DIV/0!"}},null,null,null,{"$f":"IF('201'!$M$2=2,COUNTIFS('201'!$M:$M,E67,'201'!$P:$P,1),0)","v":0},{"$f":"IF('201'!$M$2=2,COUNTIFS('201'!$M:$M,E67,'201'!$P:$P,0),0)","v":0},{"$f":"IF('202'!$M$2=2,COUNTIFS('202'!$M:$M,E67,'202'!$P:$P,1),0)","v":0},{"$f":"IF('202'!$M$2=2,COUNTIFS('202'!$M:$M,E67,'202'!$P:$P,0),0)","v":0},{"$f":"IF('203'!$M$2=2,COUNTIFS('203'!$M:$M,E67,'203'!$P:$P,1),0)","v":0},{"$f":"IF('203'!$M$2=2,COUNTIFS('203'!$M:$M,E67,'203'!$P:$P,0),0)","v":0},{"$f":"IF('204'!$M$2=2,COUNTIFS('204'!$M:$M,E67,'204'!$P:$P,1),0)","v":0},{"$f":"IF('204'!$M$2=2,COUNTIFS('204'!$M:$M,E67,'204'!$P:$P,0),0)","v":0},{"$f":"IF('205'!$M$2=2,COUNTIFS('205'!$M:$M,E67,'205'!$P:$P,1),0)","v":0},{"$f":"IF('205'!$M$2=2,COUNTIFS('205'!$M:$M,E67,'205'!$P:$P,0),0)","v":0},null,{"$f":"SUM(W67:AF67)","v":0},null,{"$f":"SUM(W67,Y67,AA67,AC67,AE67)/AH67","v":{"$error":"#DIV/0!"}}]
[6,7,{"$f":"A68*B68","v":42},null,{"$f":"(A68&\" ∙ \"&B68)","v":"6 ∙ 7"},{"$f":"IF('201'!$M$2=1,COUNTIFS('201'!$M:$M,E68,'201'!$P:$P,1),0)","v":0},{"$f":"IF('201'!$M$2=1,COUNTIFS('201'!$M:$M,E68,'201'!$P:$P,0),0)","v":0},{"$f":"IF('202'!$M$2=1,COUNTIFS('202'!$M:$M,E68,'202'!$P:$P,1),0)","v":0},{"$f":"IF('202'!$M$2=1,COUNTIFS('202'!$M:$M,E68,'202'!$P:$P,0),0)","v":0},{"$f":"IF('203'!$M$2=1,COUNTIFS('203'!$M:$M,E68,'203'!$P:$P,1),0)","v":0},{"$f":"IF('203'!$M$2=1,COUNTIFS('203'!$M:$M,E68,'203'!$P:$P,0),0)","v":0},{"$f":"IF('204'!$M$2=1,COUNTIFS('204'!$M:$M,E68,'204'!$P:$P,1),0)","v":0},{"$f":"IF('204'!$M$2=1,COUNTIFS('204'!$M:$M,E68,'204'!$P:$P,0),0)","v":0},{"$f":"IF('205'!$M$2=1,COUNTIFS('205'!$M:$M,E68,'205'!$P:$P,1),0)","v":0},{"$f":"IF('205'!$M$2=1,COUNTIFS('205'!$M:$M,E68,'205'!$P:$P,0),0)","v":0},null,0,null,{"$error":"#DIV/0!"},null,null,null,{"$f":"IF('201'!$M$2=2,COUNTIFS('201'!$M:$M,E68,'201'!$P:$P,1),0)","v":0},{"$f":"IF('201'!$M$2=2,COUNTIFS('201'!$M:$M,E68,'201'!$P:$P,0),0)","v":0},{"$f":"IF('202'!$M$2=2,COUNTIFS('202'!$M:$M,E68,'202'!$P:$P,1),0)","v":0},{"$f":"IF('202'!$M$2=2,COUNTIFS('202'!$M:$M,E68,'202'!$P:$P,0),0)","v":0},{"$f":"IF('203'!$M$2=2,COUNTIFS('203'!$M:$M,E68,'203'!$P:$P,1),0)","v":0},{"$f":"IF('203'!$M$2=2,COUNTIFS('203'!$M:$M,E68,'203'!$P:$P,0),0)","v":0},{"$f":"IF('204'!$M$2=2,COUNTIFS('204'!$M:$M,E68,'204'!$P:$P,1),0)","v":0},{"$f":"IF('204'!$M$2=2,COUNTIFS('204'!$M:$M,E68,'204'!$P:$P,0),0)","v":0},{"$f":"IF('205'!$M$2=2,COUNTIFS('205'!$M:$M,E68,'205'!$P:$P,1),0)","v":0},{"$f":"IF('205'!$M$2=2,COUNTIFS('205'!$M:$M,E68,'205'!$P:$P,0),0)","v":0},null,0,null,{"$error":"#DIV/0!"}]
[7,7,49,null,"7 ∙ 7",{"$f":"IF('201'!$M$2=1,COUNTIFS('201'!$M:$M,E69,'201'!$P:$P,1),0)","v":0},{"$f":"IF('201'!$M$2=1,COUNTIFS('201'!$M:$M,E69,'201'!$P:$P,0),0)","v":0},{"$f":"IF('202'!$M$2=1,COUNTIFS('202'!$M:$M,E69,'202'!$P:$P,1),0)","v":0},{"$f":"IF('202'!$M$2=1,COUNTIFS('202'!$M:$M,E69,'202'!$P:$P,0),0)","v":0},{"$f":"IF('203'!$M$2=1,COUNTIFS('203'!$M:$M,E69,'203'!$P:$P,1),0)","v":0},{"$f":"IF('203'!$M$2=1,COUNTIFS('203'!$M:$M,E69,'203'!$P:$P,0),0)","v":0},{"$f":"IF('204'!$M$2=1,COUNTIFS('204'!$M:$M,E69,'204'!$P:$P,1),0)","v":0},{"$f":"IF('204'!$M$2=1,COUNTIFS('204'!$M:$M,E69,'204'!$P:$P,0),0)","v":0},{"$f":"IF('205'!$M$2=1,COUNTIFS('205'!$M:$M,E69,'205'!$P:$P,1),0)","v":0},{"$f":"IF('205'!$M$2=1,COUNTIFS('205'!$M:$M,E69,'205'!$P:$P,0),0)","v":0},null,0,null,{"$error":"#DIV/0!"},null,null,null,{"$f":"IF('201'!$M$2=2,COUNTIFS('201'!$M:$M,E69,'201'!$P:$P,1),0)","v":0},{"$f":"IF('201'!$M$2=2,COUNTIFS('201'!$M:$M,E69,'201'!$P:$P,0),0)","v":0},{"$f":"IF('202'!$M$2=2,COUNTIFS('202'!$M:$M,E69,'202'!$P:$P,1),0)","v":0},{"$f":"IF('202'!$M$2=2,COUNTIFS('202'!$M:$M,E69,'202'!$P:$P,0),0)","v":0},{"$f":"IF('203'!$M$2=2,COUNTIFS('203'!$M:$M,E69,'203'!$P:$P,1),0)","v":0},{"$f":"IF('203'!$M$2=2,COUNTIFS('203'!$M:$M,E69,'203'!$P:$P,0),0)","v":0},{"$f":"IF('204'!$M$2=2,COUNTIFS('204'!$M:$M,E69,'204'!$P:$P,1),0)","v":0},{"$f":"IF('204'!$M$2=2,COUNTIFS('204'!$M:$M,E69,'204'!$P:$P,0),0)","v":0},{"$f":"IF('205'!$M$2=2,COUNTIFS('205'!$M:$M,E69,'205'!$P:$P,1),0)","v":0},{"$f":"IF('205'!$M$2=2,COUNTIFS('205'!$M:$M,E69,'205'!$P:$P,0),0)","v":0},null,0,null,{"$error":"#DIV/0!"}]
[8,7,56,null,"8 ∙ 7",{"$f":"IF('201'!$M$2=1,COUNTIFS('201'!$M:$M,E70,'201'!$P:$P,1),0)","v":0},{"$f":"IF('201'!$M$2=1,COUNTIFS('201'!$M:$M,E70,'201'!$P:$P,0),0)","v":0},{"$f":"IF('202'!$M$2=1,COUNTIFS('202'!$M:$M,E70,'202'!$P:$P,1),0)","v":0},{"$f":"IF('202'!$M$2=1,COUNTIFS('202'!$M:$M,E70,'202'!$P:$P,0),0)","v":0},{"$f":"IF('203'!$M$2=1,COUNTIFS('203'!$M:$M,E70,'203'!$P:$P,1),0)","v":0},{"$f":"IF('203'!$M$2=1,COUNTIFS('203'!$M:$M,E70,'203'!$P:$P,0),0)","v":0},{"$f":"IF('204'!$M$2=1,COUNTIFS('204'!$M:$M,E70,'204'!$P:$P,1),0)","v":0},{"$f":"IF('204'!$M$2=1,COUNTIFS('204'!$M:$M,E70,'204'!$P:$P,0),0)","v":0},{"$f":"IF('205'!$M$2=1,COUNTIFS('205'!$M:$M,E70,'205'!$P:$P,1),0)","v":0},{"$f":"IF('205'!$M$2=1,COUNTIFS('205'!$M:$M,E70,'205'!$P:$P,0),0)","v":0},null,0,null,{"$error":"#DIV/0!"},null,null,null,{"$f":"IF('201'!$M$2=2,COUNTIFS('201'!$M:$M,E70,'201'!$P:$P,1),0)","v":0},{"$f":"IF('201'!$M$2=2,COUNTIFS('201'!$M:$M,E70,'201'!$P:$P,0),0)","v":0},{"$f":"IF('202'!$M$2=2,COUNTIFS('202'!$M:$M,E70,'202'!$P:$P,1),0)","v":0},{"$f":"IF('202'!$M$2=2,COUNTIFS('202'!$M:$M,E70,'202'!$P:$P,0),0)","v":0},{"$f":"IF('203'!$M$2=2,COUNTIFS('203'!$M:$M,E70,'203'!$P:$P,1),0)","v":0},{"$f":"IF('203'!$M$2=2,COUNTIFS('203'!$M:$M,E70,'203'!$P:$P,0),0)","v":0},{"$f":"IF('204'!$M$2=2,COUNTIFS('204'!$M:$M,E70,'204'!$P:$P,1),0)","v":0},{"$f":"IF('204'!$M$2=2,COUNTIFS('204'!$M:$M,E70,'204'!$P:$P,0),0)","v":0},{"$f":"IF('205'!$M$2=2,COUNTIFS('205'!$M:$M,E70,'205'!$P:$P,1),0)","v":0},{"$f":"IF('205'!$M$2=2,COUNTIFS('205'!$M:$M,E70,'205'!$P:$P,0),0)","v":0},null,0,null,{"$error":"#DIV/0!"}]
[9,7,63,null,"9 ∙ 7",{"$f":"IF('201'!$M$2=1,COUNTIFS('201'!$M:$M,E71,'201'!$P:$P,1),0)","v":0},{"$f":"IF('201'!$M$2=1,COUNTIFS('201'!$M:$M,E71,'201'!$P:$P,0),0)","v":0},{"$f":"IF('202'!$M$2=1,COUNTIFS('202'!$M:$M,E71,'202'!$P:$P,1),0)","v":0},{"$f":"IF('202'!$M$2=1,COUNTIFS('202'!$M:$M,E71,'202'!$P:$P,0),0)","v":0},{"$f":"IF('203'!$M$2=1,COUNTIFS('203'!$M:$M,E71,'203'!$P:$P,1),0)","v":0},{"$f":"IF('203'!$M$2=1,COUNTIFS('203'!$M:$M,E71,'203'!$P:$P,0),0)","v":0},{"$f":"IF('204'!$M$2=1,COUNTIFS('204'!$M:$M,E71,'204'!$P:$P,1),0)","v":0},{"$f":"IF('204'!$M$2=1,COUNTIFS('204'!$M:$M,E71,'204'!$P:$P,0),0)","v":0},{"$f":"IF('205'!$M$2=1,COUNTIFS('205'!$M:$M,E71,'205'!$P:$P,1),0)","v":0},{"$f":"IF('205'!$M$2=1,COUNTIFS('205'!$M:$M,E71,'205'!$P:$P,0),0)","v":0},null,0,null,{"$error":"#DIV/0!"},null,null,null,{"$f":"IF('201'!$M$2=2,COUNTIFS('201'!$M:$M,E71,'201'!$P:$P,1),0)","v":0},{"$f":"IF('201'!$M$2=2,COUNTIFS('201'!$M:$M,E71,'201'!$P:$P,0),0)","v":0},{"$f":"IF('202'!$M$2=2,COUNTIFS('202'!$M:$M,E71,'202'!$P:$P,1),0)","v":0},{"$f":"IF('202'!$M$2=2,COUNTIFS('202'!$M:$M,E71,'202'!$P:$P,0),0)","v":0},{"$f":"IF('203'!$M$2=2,COUNTIFS('203'!$M:$M,E71,'203'!$P:$P,1),0)","v":0},{"$f":"IF('203'!$M$2=2,COUNTIFS('203'!$M:$M,E71,'203'!$P:$P,0),0)","v":0},{"$f":"IF('204'!$M$2=2,COUNTIFS('204'!$M:$M,E71,'204'!$P:$P,1),0)","v":0},{"$f":"IF('204'!$M$2=2,COUNTIFS('204'!$M:$M,E71,'204'!$P:$P,0),0)","v":0},{"$f":"IF('205'!$M$2=2,COUNTIFS('205'!$M:$M,E71,'205'!$P:$P,1),0)","v":0},{"$f":"IF('205'!$M$2=2,COUNTIFS('205'!$M:$M,E71,'205'!$P:$P,0),0)","v":0},null,0,null,{"$error":"#DIV/0!"}]
[10,7,70,null,"10 ∙ 7",{"$f":"IF('201'!$M$2=1,COUNTIFS('201'!$M:$M,E72,'201'!$P:$P,1),0)","v":0},{"$f":"IF('201'!$M$2=1,COUNTIFS('201'!$M:$M,E72,'201'!$P:$P,0),0)","v":0},{"$f":"IF('202'!$M$2=1,COUNTIFS('202'!$M:$M,E72,'202'!$P:$P,1),0)","v":0},{"$f":"IF('202'!$M$2=1,COUNTIFS('202'!$M:$M,E72,'202'!$P:$P,0),0)","v":0},{"$f":"IF('203'!$M$2=1,COUNTIFS('203'!$M:$M,E72,'203'!$P:$P,1),0)","v":0},{"$f":"IF('203'!$M$2=1,COUNTIFS('203'!$M:$M,E72,'203'!$P:$P,0),0)","v":0},{"$f":"IF('204'!$M$2=1,COUNTIFS('204'!$M:$M,E72,'204'!$P:$P,1),0)","v":0},{"$f":"IF('204'!$M$2=1,COUNTIFS('204'!$M:$M,E72,'204'!$P:$P,0),0)","v":0},{"$f":"IF('205'!$M$2=1,COUNTIFS('205'!$M:$M,E72,'205'!$P:$P,1),0)","v":0},{"$f":"IF('205'!$M$2=1,COUNTIFS('205'!$M:$M,E72,'205'!$P:$P,0),0)","v":0},null,0,null,{"$error":"#DIV/0!"},null,null,null,{"$f":"IF('201'!$M$2=2,COUNTIFS('201'!$M:$M,E72,'201'!$P:$P,1),0)","v":0},{"$f":"IF('201'!$M$2=2,COUNTIFS('201'!$M:$M,E72,'201'!$P:$P,0),0)","v":0},{"$f":"IF('202'!$M$2=2,COUNTIFS('202'!$M:$M,E72,'202'!$P:$P,1),0)","v":0},{"$f":"IF('202'!$M$2=2,COUNTIFS('202'!$M:$M,E72,'202'!$P:$P,0),0)","v":0},{"$f":"IF('203'!$M$2=2,COUNTIFS('203'!$M:$M,E72,'203'!$P:$P,1),0)","v":0},{"$f":"IF('203'!$M$2=2,COUNTIFS('203'!$M:$M,E72,'203'!$P:$P,0),0)","v":0},{"$f":"IF('204'!$M$2=2,COUNTIFS('204'!$M:$M,E72,'204'!$P:$P,1),0)","v":0},{"$f":"IF('204'!$M$2=2,COUNTIFS('204'!$M:$M,E72,'204'!$P:$P,0),0)","v":0},{"$f":"IF('205'!$M$2=2,COUNTIFS('205'!$M:$M,E72,'205'!$P:$P,1),0)","v":0},{"$f":"IF('205'!$M$2=2,COUNTIFS('205'!$M:$M,E72,'205'!$P:$P,0),0)","v":0},null,0,null,{"$error":"#DIV/0!"}]
[1,8,8,null,"1 ∙ 8",{"$f":"IF('201'!$M$2=1,COUNTIFS('201'!$M:$M,E73,'201'!$P:$P,1),0)","v":0},{"$f":"IF('201'!$M$2=1,COUNTIFS('201'!$M:$M,E73,'201'!$P:$P,0),0)","v":0},{"$f":"IF('202'!$M$2=1,COUNTIFS('202'!$M:$M,E73,'202'!$P:$P,1),0)","v":0},{"$f":"IF('202'!$M$2=1,COUNTIFS('202'!$M:$M,E73,'202'!$P:$P,0),0)","v":0},{"$f":"IF('203'!$M$2=1,COUNTIFS('203'!$M:$M,E73,'203'!$P:$P,1),0)","v":0},{"$f":"IF('203'!$M$2=1,COUNTIFS('203'!$M:$M,E73,'203'!$P:$P,0),0)","v":0},{"$f":"IF('204'!$M$2=1,COUNTIFS('204'!$M:$M,E73,'204'!$P:$P,1),0)","v":0},{"$f":"IF('204'!$M$2=1,COUNTIFS('204'!$M:$M,E73,'204'!$P:$P,0),0)","v":0},{"$f":"IF('205'!$M$2=1,COUNTIFS('205'!$M:$M,E73,'205'!$P:$P,1),0)","v":0},{"$f":"IF('205'!$M$2=1,COUNTIFS('205'!$M:$M,E73,'205'!$P:$P,0),0)","v":0},null,0,null,{"$error":"#DIV/0!"},null,null,null,{"$f":"IF('201'!$M$2=2,COUNTIFS('201'!$M:$M,E73,'201'!$P:$P,1),0)","v":0},{"$f":"IF('201'!$M$2=2,COUNTIFS('201'!$M:$M,E73,'201'!$P:$P,0),0)","v":0},{"$f":"IF('202'!$M$2=2,COUNTIFS('202'!$M:$M,E73,'202'!$P:$P,1),0)","v":0},{"$f":"IF('202'!$M$2=2,COUNTIFS('202'!$M:$M,E73,'202'!$P:$P,0),0)","v":0},{"$f":"IF('203'!$M$2=2,COUNTIFS('203'!$M:$M,E73,'203'!$P:$P,1),0)","v":0},{"$f":"IF('203'!$M$2=2,COUNTIFS('203'!$M:$M,E73,'203'!$P:$P,0),0)","v":0},{"$f":"IF('204'!$M$2=2,COUNTIFS('204'!$M:$M,E73,'204'!$P:$P,1),0)","v":0},{"$f":"IF('204'!$M$2=2,COUNTIFS('204'!$M:$M,E73,'204'!$P:$P,0),0)","v":0},{"$f":"IF('205'!$M$2=2,COUNTIFS('205'!$M:$M,E73,'205'!$P:$P,1),0)","v":0},{"$f":"IF('205'!$M$2=2,COUNTIFS('205'!$M:$M,E73,'205'!$P:$P,0),0)","v":0},null,0,null,{"$error":"#DIV/0!"}]
[2,8,16,null,"2 ∙ 8",{"$f":"IF('201'!$M$2=1,COUNTIFS('201'!$M:$M,E74,'201'!$P:$P,1),0)","v":0},{"$f":"IF('201'!$M$2=1,COUNTIFS('201'!$M:$M,E74,'201'!$P:$P,0),0)","v":0},{"$f":"IF('202'!$M$2=1,COUNTIFS('202'!$M:$M,E74,'202'!$P:$P,1),0)","v":0},{"$f":"IF('202'!$M$2=1,COUNTIFS('202'!$M:$M,E74,'202'!$P:$P,0),0)","v":0},{"$f":"IF('203'!$M$2=1,COUNTIFS('203'!$M:$M,E74,'203'!$P:$P,1),0)","v":0},{"$f":"IF('203'!$M$2=1,COUNTIFS('203'!$M:$M,E74,'203'!$P:$P,0),0)","v":0},{"$f":"IF('204'!$M$2=1,COUNTIFS('204'!$M:$M,E74,'204'!$P:$P,1),0)","v":0},{"$f":"IF('204'!$M$2=1,COUNTIFS('204'!$M:$M,E74,'204'!$P:$P,0),0)","v":0},{"$f":"IF('205'!$M$2=1,COUNTIFS('205'!$M:$M,E74,'205'!$P:$P,1),0)","v":0},{"$f":"IF('205'!$M$2=1,COUNTIFS('205'!$M:$M,E74,'205'!$P:$P,0),0)","v":0},null,0,null,{"$error":"#DIV/0!"},null,null,null,{"$f":"IF('201'!$M$2=2,COUNTIFS('201'!$M:$M,E74,'201'!$P:$P,1),0)","v":0},{"$f":"IF('201'!$M$2=2,COUNTIFS('201'!$M:$M,E74,'201'!$P:$P,0),0)","v":0},{"$f":"IF('202'!$M$2=2,COUNTIFS('202'!$M:$M,E74,'202'!$P:$P,1),0)","v":0},{"$f":"IF('202'!$M$2=2,COUNTIFS('202'!$M:$M,E74,'202'!$P:$P,0),0)","v":0},{"$f":"IF('203'!$M$2=2,COUNTIFS('203'!$M:$M,E74,'203'!$P:$P,1),0)","v":0},{"$f":"IF('203'!$M$2=2,COUNTIFS('203'!$M:$M,E74,'203'!$P:$P,0),0)","v":0},{"$f":"IF('204'!$M$2=2,COUNTIFS('204'!$M:$M,E74,'204'!$P:$P,1),0)","v":0},{"$f":"IF('204'!$M$2=2,COUNTIFS('204'!$M:$M,E74,'204'!$P:$P,0),0)","v":0},{"$f":"IF('205'!$M$2=2,COUNTIFS('205'!$M:$M,E74,'205'!$P:$P,1),0)","v":0},{"$f":"IF('205'!$M$2=2,COUNTIFS('205'!$M:$M,E74,'205'!$P:$P,0),0)","v":0},null,0,null,{"$error":"#DIV/0!"}]
[3,8,24,null,"3 ∙ 8",{"$f":"IF('201'!$M$2=1,COUNTIFS('201'!$M:$M,E75,'201'!$P:$P,1),0)","v":0},{"$f":"IF('201'!$M$2=1,COUNTIFS('201'!$M:$M,E75,'201'!$P:$P,0),0)","v":0},{"$f":"IF('202'!$M$2=1,COUNTIFS('202'!$M:$M,E75,'202'!$P:$P,1),0)","v":0},{"$f":"IF('202'!$M$2=1,COUNTIFS('202'!$M:$M,E75,'202'!$P:$P,0),0)","v":0},{"$f":"IF('203'!$M$2=1,COUNTIFS('203'!$M:$M,E75,'203'!$P:$P,1),0)","v":0},{"$f":"IF('203'!$M$2=1,COUNTIFS('203'!$M:$M,E75,'203'!$P:$P,0),0)","v":0},{"$f":"IF('204'!$M$2=1,COUNTIFS('204'!$M:$M,E75,'204'!$P:$P,1),0)","v":0},{"$f":"IF('204'!$M$2=1,COUNTIFS('204'!$M:$M,E75,'204'!$P:$P,0),0)","v":0},{"$f":"IF('205'!$M$2=1,COUNTIFS('205'!$M:$M,E75,'205'!$P:$P,1),0)","v":0},{"$f":"IF('205'!$M$2=1,COUNTIFS('205'!$M:$M,E75,'205'!$P:$P,0),0)","v":0},null,0,null,{"$error":"#DIV/0!"},null,null,null,{"$f":"IF('201'!$M$2=2,COUNTIFS('201'!$M:$M,E75,'201'!$P:$P,1),0)","v":0},{"$f":"IF('201'!$M$2=2,COUNTIFS('201'!$M:$M,E75,'201'!$P:$P,0),0)","v":0},{"$f":"IF('202'!$M$2=2,COUNTIFS('202'!$M:$M,E75,'202'!$P:$P,1),0)","v":0},{"$f":"IF('202'!$M$2=2,COUNTIFS('202'!$M:$M,E75,'202'!$P:$P,0),0)","v":0},{"$f":"IF('203'!$M$2=2,COUNTIFS('203'!$M:$M,E75,'203'!$P:$P,1),0)","v":0},{"$f":"IF('203'!$M$2=2,COUNTIFS('203'!$M:$M,E75,'203'!$P:$P,0),0)","v":0},{"$f":"IF('204'!$M$2=2,COUNTIFS('204'!$M:$M,E75,'204'!$P:$P,1),0)","v":0},{"$f":"IF('204'!$M$2=2,COUNTIFS('204'!$M:$M,E75,'204'!$P:$P,0),0)","v":0},{"$f":"IF('205'!$M$2=2,COUNTIFS('205'!$M:$M,E75,'205'!$P:$P,1),0)","v":0},{"$f":"IF('205'!$M$2=2,COUNTIFS('205'!$M:$M,E75,'205'!$P:$P,0),0)","v":0},null,0,null,{"$error":"#DIV/0!"}]
[4,8,32,null,"4 ∙ 8",{"$f":"IF('201'!$M$2=1,COUNTIFS('201'!$M:$M,E76,'201'!$P:$P,1),0)","v":0},{"$f":"IF('201'!$M$2=1,COUNTIFS('201'!$M:$M,E76,'201'!$P:$P,0),0)","v":0},{"$f":"IF('202'!$M$2=1,COUNTIFS('202'!$M:$M,E76,'202'!$P:$P,1),0)","v":0},{"$f":"IF('202'!$M$2=1,COUNTIFS('202'!$M:$M,E76,'202'!$P:$P,0),0)","v":0},{"$f":"IF('203'!$M$2=1,COUNTIFS('203'!$M:$M,E76,'203'!$P:$P,1),0)","v":0},{"$f":"IF('203'!$M$2=1,COUNTIFS('203'!$M:$M,E76,'203'!$P:$P,0),0)","v":0},{"$f":"IF('204'!$M$2=1,COUNTIFS('204'!$M:$M,E76,'204'!$P:$P,1),0)","v":0},{"$f":"IF('204'!$M$2=1,COUNTIFS('204'!$M:$M,E76,'204'!$P:$P,0),0)","v":0},{"$f":"IF('205'!$M$2=1,COUNTIFS('205'!$M:$M,E76,'205'!$P:$P,1),0)","v":0},{"$f":"IF('205'!$M$2=1,COUNTIFS('205'!$M:$M,E76,'205'!$P:$P,0),0)","v":0},null,0,null,{"$error":"#DIV/0!"},null,null,null,{"$f":"IF('201'!$M$2=2,COUNTIFS('201'!$M:$M,E76,'201'!$P:$P,1),0)","v":0},{"$f":"IF('201'!$M$2=2,COUNTIFS('201'!$M:$M,E76,'201'!$P:$P,0),0)","v":0},{"$f":"IF('202'!$M$2=2,COUNTIFS('202'!$M:$M,E76,'202'!$P:$P,1),0)","v":0},{"$f":"IF('202'!$M$2=2,COUNTIFS('202'!$M:$M,E76,'202'!$P:$P,0),0)","v":0},{"$f":"IF('203'!$M$2=2,COUNTIFS('203'!$M:$M,E76,'203'!$P:$P,1),0)","v":0},{"$f":"IF('203'!$M$2=2,COUNTIFS('203'!$M:$M,E76,'203'!$P:$P,0),0)","v":0},{"$f":"IF('204'!$M$2=2,COUNTIFS('204'!$M:$M,E76,'204'!$P:$P,1),0)","v":0},{"$f":"IF('204'!$M$2=2,COUNTIFS('204'!$M:$M,E76,'204'!$P:$P,0),0)","v":0},{"$f":"IF('205'!$M$2=2,COUNTIFS('205'!$M:$M,E76,'205'!$P:$P,1),0)","v":0},{"$f":"IF('205'!$M$2=2,COUNTIFS('205'!$M:$M,E76,'205'!$P:$P,0),0)","v":0},null,0,null,{"$error":"#DIV/0!"}]
[5,8,40,null,"5 ∙ 8",{"$f":"IF('201'!$M$2=1,COUNTIFS('201'!$M:$M,E77,'201'!$P:$P,1),0)","v":0},{"$f":"IF('201'!$M$2=1,COUNTIFS('201'!$M:$M,E77,'201'!$P:$P,0),0)","v":0},{"$f":"IF('202'!$M$2=1,COUNTIFS('202'!$M:$M,E77,'202'!$P:$P,1),0)","v":0},{"$f":"IF('202'!$M$2=1,COUNTIFS('202'!$M:$M,E77,'202'!$P:$P,0),0)","v":0},{"$f":"IF('203'!$M$2=1,COUNTIFS('203'!$M:$M,E77,'203'!$P:$P,1),0)","v":0},{"$f":"IF('203'!$M$2=1,COUNTIFS('203'!$M:$M,E77,'203'!$P:$P,0),0)","v":0},{"$f":"IF('204'!$M$2=1,COUNTIFS('204'!$M:$M,E77,'204'!$P:$P,1),0)","v":0},{"$f":"IF('204'!$M$2=1,COUNTIFS('204'!$M:$M,E77,'204'!$P:$P,0),0)","v":0},{"$f":"IF('205'!$M$2=1,COUNTIFS('205'!$M:$M,E77,'205'!$P:$P,1),0)","v":0},{"$f":"IF('205'!$M$2=1,COUNTIFS('205'!$M:$M,E77,'205'!$P:$P,0),0)","v":0},null,0,null,{"$error":"#DIV/0!"},null,null,null,{"$f":"IF('201'!$M$2=2,COUNTIFS('201'!$M:$M,E77,'201'!$P:$P,1),0)","v":0},{"$f":"IF('201'!$M$2=2,COUNTIFS('201'!$M:$M,E77,'201'!$P:$P,0),0)","v":0},{"$f":"IF('202'!$M$2=2,COUNTIFS('202'!$M:$M,E77,'202'!$P:$P,1),0)","v":0},{"$f":"IF('202'!$M$2=2,COUNTIFS('202'!$M:$M,E77,'202'!$P:$P,0),0)","v":0},{"$f":"IF('203'!$M$2=2,COUNTIFS('203'!$M:$M,E77,'203'!$P:$P,1),0)","v":0},{"$f":"IF('203'!$M$2=2,COUNTIFS('203'!$M:$M,E77,'203'!$P:$P,0),0)","v":0},{"$f":"IF('204'!$M$2=2,COUNTIFS('204'!$M:$M,E77,'204'!$P:$P,1),0)","v":0},{"$f":"IF('204'!$M$2=2,COUNTIFS('204'!$M:$M,E77,'204'!$P:$P,0),0)","v":0},{"$f":"IF('205'!$M$2=2,COUNTIFS('205'!$M:$M,E77,'205'!$P:$P,1),0)","v":0},{"$f":"IF('205'!$M$2=2,COUNTIFS('205'!$M:$M,E77,'205'!$P:$P,0),0)","v":0},null,0,null,{"$error":"#DIV/0!"}]
[6,8,48,null,"6 ∙ 8",{"$f":"IF('201'!$M$2=1,COUNTIFS('201'!$M:$M,E78,'201'!$P:$P,1),0)","v":0},{"$f":"IF('201'!$M$2=1,COUNTIFS('201'!$M:$M,E78,'201'!$P:$P,0),0)","v":0},{"$f":"IF('202'!$M$2=1,COUNTIFS('202'!$M:$M,E78,'202'!$P:$P,1),0)","v":0},{"$f":"IF('202'!$M$2=1,COUNTIFS('202'!$M:$M,E78,'202'!$P:$P,0),0)","v":0},{"$f":"IF('203'!$M$2=1,COUNTIFS('203'!$M:$M,E78,'203'!$P:$P,1),0)","v":0},{"$f":"IF('203'!$M$2=1,COUNTIFS('203'!$M:$M,E78,'203'!$P:$P,0),0)","v":0},{"$f":"IF('204'!$M$2=1,COUNTIFS('204'!$M:$M,E78,'204'!$P:$P,1),0)","v":0},{"$f":"IF('204'!$M$2=1,COUNTIFS('204'!$M:$M,E78,'204'!$P:$P,0),0)","v":0},{"$f":"IF('205'!$M$2=1,COUNTIFS('205'!$M:$M,E78,'205'!$P:$P,1),0)","v":0},{"$f":"IF('205'!$M$2=1,COUNTIFS('205'!$M:$M,E78,'205'!$P:$P,0),0)","v":0},null,0,null,{"$error":"#DIV/0!"},null,null,null,{"$f":"IF('201'!$M$2=2,COUNTIFS('201'!$M:$M,E78,'201'!$P:$P,1),0)","v":0},{"$f":"IF('201'!$M$2=2,COUNTIFS('201'!$M:$M,E78,'201'!$P:$P,0),0)","v":0},{"$f":"IF('202'!$M$2=2,COUNTIFS('202'!$M:$M,E78,'202'!$P:$P,1),0)","v":0},{"$f":"IF('202'!$M$2=2,COUNTIFS('202'!$M:$M,E78,'202'!$P:$P,0),0)","v":0},{"$f":"IF('203'!$M$2=2,COUNTIFS('203'!$M:$M,E78,'203'!$P:$P,1),0)","v":0},{"$f":"IF('203'!$M$2=2,COUNTIFS('203'!$M:$M,E78,'203'!$P:$P,0),0)","v":0},{"$f":"IF('204'!$M$2=2,COUNTIFS('204'!$M:$M,E78,'204'!$P:$P,1),0)","v":0},{"$f":"IF('204'!$M$2=2,COUNTIFS('204'!$M:$M,E78,'204'!$P:$P,0),0)","v":0},{"$f":"IF('205'!$M$2=2,COUNTIFS('205'!$M:$M,E78,'205'!$P:$P,1),0)","v":0},{"$f":"IF('205'!$M$2=2,COUNTIFS('205'!$M:$M,E78,'205'!$P:$P,0),0)","v":0},null,0,null,{"$error":"#DIV/0!"}]
[7,8,56,null,"7 ∙ 8",{"$f":"IF('201'!$M$2=1,COUNTIFS('201'!$M:$M,E79,'201'!$P:$P,1),0)","v":0},{"$f":"IF('201'!$M$2=1,COUNTIFS('201'!$M:$M,E79,'201'!$P:$P,0),0)","v":0},{"$f":"IF('202'!$M$2=1,COUNTIFS('202'!$M:$M,E79,'202'!$P:$P,1),0)","v":0},{"$f":"IF('202'!$M$2=1,COUNTIFS('202'!$M:$M,E79,'202'!$P:$P,0),0)","v":0},{"$f":"IF('203'!$M$2=1,COUNTIFS('203'!$M:$M,E79,'203'!$P:$P,1),0)","v":0},{"$f":"IF('203'!$M$2=1,COUNTIFS('203'!$M:$M,E79,'203'!$P:$P,0),0)","v":0},{"$f":"IF('204'!$M$2=1,COUNTIFS('204'!$M:$M,E79,'204'!$P:$P,1),0)","v":0},{"$f":"IF('204'!$M$2=1,COUNTIFS('204'!$M:$M,E79,'204'!$P:$P,0),0)","v":0},{"$f":"IF('205'!$M$2=1,COUNTIFS('205'!$M:$M,E79,'205'!$P:$P,1),0)","v":0},{"$f":"IF('205'!$M$2=1,COUNTIFS('205'!$M:$M,E79,'205'!$P:$P,0),0)","v":0},null,0,null,{"$error":"#DIV/0!"},null,null,null,{"$f":"IF('201'!$M$2=2,COUNTIFS('201'!$M:$M,E79,'201'!$P:$P,1),0)","v":0},{"$f":"IF('201'!$M$2=2,COUNTIFS('201'!$M:$M,E79,'201'!$P:$P,0),0)","v":0},{"$f":"IF('202'!$M$2=2,COUNTIFS('202'!$M:$M,E79,'202'!$P:$P,1),0)","v":0},{"$f":"IF('202'!$M$2=2,COUNTIFS('202'!$M:$M,E79,'202'!$P:$P,0),0)","v":0},{"$f":"IF('203'!$M$2=2,COUNTIFS('203'!$M:$M,E79,'203'!$P:$P,1),0)","v":0},{"$f":"IF('203'!$M$2=2,COUNTIFS('203'!$M:$M,E79,'203'!$P:$P,0),0)","v":0},{"$f":"IF('204'!$M$2=2,COUNTIFS('204'!$M:$M,E79,'204'!$P:$P,1),0)","v":0},{"$f":"IF('204'!$M$2=2,COUNTIFS('204'!$M:$M,E79,'204'!$P:$P,0),0)","v":0},{"$f":"IF('205'!$M$2=2,COUNTIFS('205'!$M:$M,E79,'205'!$P:$P,1),0)","v":0},{"$f":"IF('205'!$M$2=2,COUNTIFS('205'!$M:$M,E79,'205'!$P:$P,0),0)","v":0},null,0,null,{"$error":"#DIV/0!"}]
[8,8,64,null,"8 ∙ 8",{"$f":"IF('201'!$M$2=1,COUNTIFS('201'!$M:$M,E80,'201'!$P:$P,1),0)","v":0},{"$f":"IF('201'!$M$2=1,COUNTIFS('201'!$M:$M,E80,'201'!$P:$P,0),0)","v":0},{"$f":"IF('202'!$M$2=1,COUNTIFS('202'!$M:$M,E80,'202'!$P:$P,1),0)","v":0},{"$f":"IF('202'!$M$2=1,COUNTIFS('202'!$M:$M,E80,'202'!$P:$P,0),0)","v":0},{"$f":"IF('203'!$M$2=1,COUNTIFS('203'!$M:$M,E80,'203'!$P:$P,1),0)","v":0},{"$f":"IF('203'!$M$2=1,COUNTIFS('203'!$M:$M,E80,'203'!$P:$P,0),0)","v":0},{"$f":"IF('204'!$M$2=1,COUNTIFS('204'!$M:$M,E80,'204'!$P:$P,1),0)","v":0},{"$f":"IF('204'!$M$2=1,COUNTIFS('204'!$M:$M,E80,'204'!$P:$P,0),0)","v":0},{"$f":"IF('205'!$M$2=1,COUNTIFS('205'!$M:$M,E80,'205'!$P:$P,1),0)","v":0},{"$f":"IF('205'!$M$2=1,COUNTIFS('205'!$M:$M,E80,'205'!$P:$P,0),0)","v":0},null,0,null,{"$error":"#DIV/0!"},null,null,null,{"$f":"IF('201'!$M$2=2,COUNTIFS('201'!$M:$M,E80,'201'!$P:$P,1),0)","v":0},{"$f":"IF('201'!$M$2=2,COUNTIFS('201'!$M:$M,E80,'201'!$P:$P,0),0)","v":0},{"$f":"IF('202'!$M$2=2,COUNTIFS('202'!$M:$M,E80,'202'!$P:$P,1),0)","v":0},{"$f":"IF('202'!$M$2=2,COUNTIFS('202'!$M:$M,E80,'202'!$P:$P,0),0)","v":0},{"$f":"IF('203'!$M$2=2,COUNTIFS('203'!$M:$M,E80,'203'!$P:$P,1),0)","v":0},{"$f":"IF('203'!$M$2=2,COUNTIFS('203'!$M:$M,E80,'203'!$P:$P,0),0)","v":0},{"$f":"IF('204'!$M$2=2,COUNTIFS('204'!$M:$M,E80,'204'!$P:$P,1),0)","v":0},{"$f":"IF('204'!$M$2=2,COUNTIFS('204'!$M:$M,E80,'204'!$P:$P,0),0)","v":0},{"$f":"IF('205'!$M$2=2,COUNTIFS('205'!$M:$M,E80,'205'!$P:$P,1),0)","v":0},{"$f":"IF('205'!$M$2=2,COUNTIFS('205'!$M:$M,E80,'205'!$P:$P,0),0)","v":0},null,0,null,{"$error":"#DIV/0!"}]
[9,8,72,null,"9 ∙ 8",{"$f":"IF('201'!$M$2=1,COUNTIFS('201'!$M:$M,E81,'201'!$P:$P,1),0)","v":0},{"$f":"IF('201'!$M$2=1,COUNTIFS('201'!$M:$M,E81,'201'!$P:$P,0),0)","v":0},{"$f":"IF('202'!$M$2=1,COUNTIFS('202'!$M:$M,E81,'202'!$P:$P,1),0)","v":0},{"$f":"IF('202'!$M$2=1,COUNTIFS('202'!$M:$M,E81,'202'!$P:$P,0),0)","v":0},{"$f":"IF('203'!$M$2=1,COUNTIFS('203'!$M:$M,E81,'203'!$P:$P,1),0)","v":0},{"$f":"IF('203'!$M$2=1,COUNTIFS('203'!$M:$M,E81,'203'!$P:$P,0),0)","v":0},{"$f":"IF('204'!$M$2=1,COUNTIFS('204'!$M:$M,E81,'204'!$P:$P,1),0)","v":0},{"$f":"IF('204'!$M$2=1,COUNTIFS('204'!$M:$M,E81,'204'!$P:$P,0),0)","v":0},{"$f":"IF('205'!$M$2=1,COUNTIFS('205'!$M:$M,E81,'205'!$P:$P,1),0)","v":0},{"$f":"IF('205'!$M$2=1,COUNTIFS('205'!$M:$M,E81,'205'!$P:$P,0),0)","v":0},null,0,null,{"$error":"#DIV/0!"},null,null,null,{"$f":"IF('201'!$M$2=2,COUNTIFS('201'!$M:$M,E81,'201'!$P:$P,1),0)","v":0},{"$f":"IF('201'!$M$2=2,COUNTIFS('201'!$M:$M,E81,'201'!$P:$P,0),0)","v":0},{"$f":"IF('202'!$M$2=2,COUNTIFS('202'!$M:$M,E81,'202'!$P:$P,1),0)","v":0},{"$f":"IF('202'!$M$2=2,COUNTIFS('202'!$M:$M,E81,'202'!$P:$P,0),0)","v":0},{"$f":"IF('203'!$M$2=2,COUNTIFS('203'!$M:$M,E81,'203'!$P:$P,1),0)","v":0},{"$f":"IF('203'!$M$2=2,COUNTIFS('203'!$M:$M,E81,'203'!$P:$P,0),0)","v":0},{"$f":"IF('204'!$M$2=2,COUNTIFS('204'!$M:$M,E81,'204'!$P:$P,1),0)","v":0},{"$f":"IF('204'!$M$2=2,COUNTIFS('204'!$M:$M,E81,'204'!$P:$P,0),0)","v":0},{"$f":"IF('205'!$M$2=2,COUNTIFS('205'!$M:$M,E81,'205'!$P:$P,1),0)","v":0},{"$f":"IF('205'!$M$2=2,COUNTIFS('205'!$M:$M,E81,'205'!$P:$P,0),0)","v":0},null,0,null,{"$error":"#DIV/0!"}]
[10,8,80,null,"10 ∙ 8",{"$f":"IF('201'!$M$2=1,COUNTIFS('201'!$M:$M,E82,'201'!$P:$P,1),0)","v":0},{"$f":"IF('201'!$M$2=1,COUNTIFS('201'!$M:$M,E82,'201'!$P:$P,0),0)","v":0},{"$f":"IF('202'!$M$2=1,COUNTIFS('202'!$M:$M,E82,'202'!$P:$P,1),0)","v":0},{"$f":"IF('202'!$M$2=1,COUNTIFS('202'!$M:$M,E82,'202'!$P:$P,0),0)","v":0},{"$f":"IF('203'!$M$2=1,COUNTIFS('203'!$M:$M,E82,'203'!$P:$P,1),0)","v":0},{"$f":"IF('203'!$M$2=1,COUNTIFS('203'!$M:$M,E82,'203'!$P:$P,0),0)","v":0},{"$f":"IF('204'!$M$2=1,COUNTIFS('204'!$M:$M,E82,'204'!$P:$P,1),0)","v":0},{"$f":"IF('204'!$M$2=1,COUNTIFS('204'!$M:$M,E82,'204'!$P:$P,0),0)","v":0},{"$f":"IF('205'!$M$2=1,COUNTIFS('205'!$M:$M,E82,'205'!$P:$P,1),0)","v":0},{"$f":"IF('205'!$M$2=1,COUNTIFS('205'!$M:$M,E82,'205'!$P:$P,0),0)","v":0},null,0,null,{"$error":"#DIV/0!"},null,null,null,{"$f":"IF('201'!$M$2=2,COUNTIFS('201'!$M:$M,E82,'201'!$P:$P,1),0)","v":0},{"$f":"IF('201'!$M$2=2,COUNTIFS('201'!$M:$M,E82,'201'!$P:$P,0),0)","v":0},{"$f":"IF('202'!$M$2=2,COUNTIFS('202'!$M:$M,E82,'202'!$P:$P,1),0)","v":0},{"$f":"IF('202'!$M$2=2,COUNTIFS('202'!$M:$M,E82,'202'!$P:$P,0),0)","v":0},{"$f":"IF('203'!$M$2=2,COUNTIFS('203'!$M:$M,E82,'203'!$P:$P,1),0)","v":0},{"$f":"IF('203'!$M$2=2,COUNTIFS('203'!$M:$M,E82,'203'!$P:$P,0),0)","v":0},{"$f":"IF('204'!$M$2=2,COUNTIFS('204'!$M:$M,E82,'204'!$P:$P,1),0)","v":0},{"$f":"IF('204'!$M$2=2,COUNTIFS('204'!$M:$M,E82,'204'!$P:$P,0),0)","v":0},{"$f":"IF('205'!$M$2=2,COUNTIFS('205'!$M:$M,E82,'205'!$P:$P,1),0)","v":0},{"$f":"IF('205'!$M$2=2,COUNTIFS('205'!$M:$M,E82,'205'!$P:$P,0),0)","v":0},null,0,null,{"$error":"#DIV/0!"}]
[1,9,9,null,"1 ∙ 9",{"$f":"IF('201'!$M$2=1,COUNTIFS('201'!$M:$M,E83,'201'!$P:$P,1),0)","v":0},{"$f":"IF('201'!$M$2=1,COUNTIFS('201'!$M:$M,E83,'201'!$P:$P,0),0)","v":0},{"$f":"IF('202'!$M$2=1,COUNTIFS('202'!$M:$M,E83,'202'!$P:$P,1),0)","v":0},{"$f":"IF('202'!$M$2=1,COUNTIFS('202'!$M:$M,E83,'202'!$P:$P,0),0)","v":0},{"$f":"IF('203'!$M$2=1,COUNTIFS('203'!$M:$M,E83,'203'!$P:$P,1),0)","v":0},{"$f":"IF('203'!$M$2=1,COUNTIFS('203'!$M:$M,E83,'203'!$P:$P,0),0)","v":0},{"$f":"IF('204'!$M$2=1,COUNTIFS('204'!$M:$M,E83,'204'!$P:$P,1),0)","v":0},{"$f":"IF('204'!$M$2=1,COUNTIFS('204'!$M:$M,E83,'204'!$P:$P,0),0)","v":0},{"$f":"IF('205'!$M$2=1,COUNTIFS('205'!$M:$M,E83,'205'!$P:$P,1),0)","v":0},{"$f":"IF('205'!$M$2=1,COUNTIFS('205'!$M:$M,E83,'205'!$P:$P,0),0)","v":0},null,0,null,{"$error":"#DIV/0!"},null,null,null,{"$f":"IF('201'!$M$2=2,COUNTIFS('201'!$M:$M,E83,'201'!$P:$P,1),0)","v":0},{"$f":"IF('201'!$M$2=2,COUNTIFS('201'!$M:$M,E83,'201'!$P:$P,0),0)","v":0},{"$f":"IF('202'!$M$2=2,COUNTIFS('202'!$M:$M,E83,'202'!$P:$P,1),0)","v":0},{"$f":"IF('202'!$M$2=2,COUNTIFS('202'!$M:$M,E83,'202'!$P:$P,0),0)","v":0},{"$f":"IF('203'!$M$2=2,COUNTIFS('203'!$M:$M,E83,'203'!$P:$P,1),0)","v":0},{"$f":"IF('203'!$M$2=2,COUNTIFS('203'!$M:$M,E83,'203'!$P:$P,0),0)","v":0},{"$f":"IF('204'!$M$2=2,COUNTIFS('204'!$M:$M,E83,'204'!$P:$P,1),0)","v":0},{"$f":"IF('204'!$M$2=2,COUNTIFS('204'!$M:$M,E83,'204'!$P:$P,0),0)","v":0},{"$f":"IF('205'!$M$2=2,COUNTIFS('205'!$M:$M,E83,'205'!$P:$P,1),0)","v":0},{"$f":"IF('205'!$M$2=2,COUNTIFS('205'!$M:$M,E83,'205'!$P:$P,0),0)","v":0},null,0,null,{"$error":"#DIV/0!"}]
[2,9,18,null,"2 ∙ 9",{"$f":"IF('201'!$M$2=1,COUNTIFS('201'!$M:$M,E84,'201'!$P:$P,1),0)","v":0},{"$f":"IF('201'!$M$2=1,COUNTIFS('201'!$M:$M,E84,'201'!$P:$P,0),0)","v":0},{"$f":"IF('202'!$M$2=1,COUNTIFS('202'!$M:$M,E84,'202'!$P:$P,1),0)","v":0},{"$f":"IF('202'!$M$2=1,COUNTIFS('202'!$M:$M,E84,'202'!$P:$P,0),0)","v":0},{"$f":"IF('203'!$M$2=1,COUNTIFS('203'!$M:$M,E84,'203'!$P:$P,1),0)","v":0},{"$f":"IF('203'!$M$2=1,COUNTIFS('203'!$M:$M,E84,'203'!$P:$P,0),0)","v":0},{"$f":"IF('204'!$M$2=1,COUNTIFS('204'!$M:$M,E84,'204'!$P:$P,1),0)","v":0},{"$f":"IF('204'!$M$2=1,COUNTIFS('204'!$M:$M,E84,'204'!$P:$P,0),0)","v":0},{"$f":"IF('205'!$M$2=1,COUNTIFS('205'!$M:$M,E84,'205'!$P:$P,1),0)","v":0},{"$f":"IF('205'!$M$2=1,COUNTIFS('205'!$M:$M,E84,'205'!$P:$P,0),0)","v":0},null,0,null,{"$error":"#DIV/0!"},null,null,null,{"$f":"IF('201'!$M$2=2,COUNTIFS('201'!$M:$M,E84,'201'!$P:$P,1),0)","v":0},{"$f":"IF('201'!$M$2=2,COUNTIFS('201'!$M:$M,E84,'201'!$P:$P,0),0)","v":0},{"$f":"IF('202'!$M$2=2,COUNTIFS('202'!$M:$M,E84,'202'!$P:$P,1),0)","v":0},{"$f":"IF('202'!$M$2=2,COUNTIFS('202'!$M:$M,E84,'202'!$P:$P,0),0)","v":0},{"$f":"IF('203'!$M$2=2,COUNTIFS('203'!$M:$M,E84,'203'!$P:$P,1),0)","v":0},{"$f":"IF('203'!$M$2=2,COUNTIFS('203'!$M:$M,E84,'203'!$P:$P,0),0)","v":0},{"$f":"IF('204'!$M$2=2,COUNTIFS('204'!$M:$M,E84,'204'!$P:$P,1),0)","v":0},{"$f":"IF('204'!$M$2=2,COUNTIFS('204'!$M:$M,E84,'204'!$P:$P,0),0)","v":0},{"$f":"IF('205'!$M$2=2,COUNTIFS('205'!$M:$M,E84,'205'!$P:$P,1),0)","v":0},{"$f":"IF('205'!$M$2=2,COUNTIFS('205'!$M:$M,E84,'205'!$P:$P,0),0)","v":0},null,0,null,{"$error":"#DIV/0!"}]
[3,9,27,null,"3 ∙ 9",{"$f":"IF('201'!$M$2=1,COUNTIFS('201'!$M:$M,E85,'201'!$P:$P,1),0)","v":0},{"$f":"IF('201'!$M$2=1,COUNTIFS('201'!$M:$M,E85,'201'!$P:$P,0),0)","v":0},{"$f":"IF('202'!$M$2=1,COUNTIFS('202'!$M:$M,E85,'202'!$P:$P,1),0)","v":0},{"$f":"IF('202'!$M$2=1,COUNTIFS('202'!$M:$M,E85,'202'!$P:$P,0),0)","v":0},{"$f":"IF('203'!$M$2=1,COUNTIFS('203'!$M:$M,E85,'203'!$P:$P,1),0)","v":0},{"$f":"IF('203'!$M$2=1,COUNTIFS('203'!$M:$M,E85,'203'!$P:$P,0),0)","v":0},{"$f":"IF('204'!$M$2=1,COUNTIFS('204'!$M:$M,E85,'204'!$P:$P,1),0)","v":0},{"$f":"IF('204'!$M$2=1,COUNTIFS('204'!$M:$M,E85,'204'!$P:$P,0),0)","v":0},{"$f":"IF('205'!$M$2=1,COUNTIFS('205'!$M:$M,E85,'205'!$P:$P,1),0)","v":0},{"$f":"IF('205'!$M$2=1,COUNTIFS('205'!$M:$M,E85,'205'!$P:$P,0),0)","v":0},null,0,null,{"$error":"#DIV/0!"},null,null,null,{"$f":"IF('201'!$M$2=2,COUNTIFS('201'!$M:$M,E85,'201'!$P:$P,1),0)","v":0},{"$f":"IF('201'!$M$2=2,COUNTIFS('201'!$M:$M,E85,'201'!$P:$P,0),0)","v":0},{"$f":"IF('202'!$M$2=2,COUNTIFS('202'!$M:$M,E85,'202'!$P:$P,1),0)","v":0},{"$f":"IF('202'!$M$2=2,COUNTIFS('202'!$M:$M,E85,'202'!$P:$P,0),0)","v":0},{"$f":"IF('203'!$M$2=2,COUNTIFS('203'!$M:$M,E85,'203'!$P:$P,1),0)","v":0},{"$f":"IF('203'!$M$2=2,COUNTIFS('203'!$M:$M,E85,'203'!$P:$P,0),0)","v":0},{"$f":"IF('204'!$M$2=2,COUNTIFS('204'!$M:$M,E85,'204'!$P:$P,1),0)","v":0},{"$f":"IF('204'!$M$2=2,COUNTIFS('204'!$M:$M,E85,'204'!$P:$P,0),0)","v":0},{"$f":"IF('205'!$M$2=2,COUNTIFS('205'!$M:$M,E85,'205'!$P:$P,1),0)","v":0},{"$f":"IF('205'!$M$2=2,COUNTIFS('205'!$M:$M,E85,'205'!$P:$P,0),0)","v":0},null,0,null,{"$error":"#DIV/0!"}]
[4,9,36,null,"4 ∙ 9",{"$f":"IF('201'!$M$2=1,COUNTIFS('201'!$M:$M,E86,'201'!$P:$P,1),0)","v":0},{"$f":"IF('201'!$M$2=1,COUNTIFS('201'!$M:$M,E86,'201'!$P:$P,0),0)","v":0},{"$f":"IF('202'!$M$2=1,COUNTIFS('202'!$M:$M,E86,'202'!$P:$P,1),0)","v":0},{"$f":"IF('202'!$M$2=1,COUNTIFS('202'!$M:$M,E86,'202'!$P:$P,0),0)","v":0},{"$f":"IF('203'!$M$2=1,COUNTIFS('203'!$M:$M,E86,'203'!$P:$P,1),0)","v":0},{"$f":"IF('203'!$M$2=1,COUNTIFS('203'!$M:$M,E86,'203'!$P:$P,0),0)","v":0},{"$f":"IF('204'!$M$2=1,COUNTIFS('204'!$M:$M,E86,'204'!$P:$P,1),0)","v":0},{"$f":"IF('204'!$M$2=1,COUNTIFS('204'!$M:$M,E86,'204'!$P:$P,0),0)","v":0},{"$f":"IF('205'!$M$2=1,COUNTIFS('205'!$M:$M,E86,'205'!$P:$P,1),0)","v":0},{"$f":"IF('205'!$M$2=1,COUNTIFS('205'!$M:$M,E86,'205'!$P:$P,0),0)","v":0},null,0,null,{"$error":"#DIV/0!"},null,null,null,{"$f":"IF('201'!$M$2=2,COUNTIFS('201'!$M:$M,E86,'201'!$P:$P,1),0)","v":0},{"$f":"IF('201'!$M$2=2,COUNTIFS('201'!$M:$M,E86,'201'!$P:$P,0),0)","v":0},{"$f":"IF('202'!$M$2=2,COUNTIFS('202'!$M:$M,E86,'202'!$P:$P,1),0)","v":0},{"$f":"IF('202'!$M$2=2,COUNTIFS('202'!$M:$M,E86,'202'!$P:$P,0),0)","v":0},{"$f":"IF('203'!$M$2=2,COUNTIFS('203'!$M:$M,E86,'203'!$P:$P,1),0)","v":0},{"$f":"IF('203'!$M$2=2,COUNTIFS('203'!$M:$M,E86,'203'!$P:$P,0),0)","v":0},{"$f":"IF('204'!$M$2=2,COUNTIFS('204'!$M:$M,E86,'204'!$P:$P,1),0)","v":0},{"$f":"IF('204'!$M$2=2,COUNTIFS('204'!$M:$M,E86,'204'!$P:$P,0),0)","v":0},{"$f":"IF('205'!$M$2=2,COUNTIFS('205'!$M:$M,E86,'205'!$P:$P,1),0)","v":0},{"$f":"IF('205'!$M$2=2,COUNTIFS('205'!$M:$M,E86,'205'!$P:$P,0),0)","v":0},null,0,null,{"$error":"#DIV/0!"}]
[5,9,45,null,"5 ∙ 9",{"$f":"IF('201'!$M$2=1,COUNTIFS('201'!$M:$M,E87,'201'!$P:$P,1),0)","v":0},{"$f":"IF('201'!$M$2=1,COUNTIFS('201'!$M:$M,E87,'201'!$P:$P,0),0)","v":0},{"$f":"IF('202'!$M$2=1,COUNTIFS('202'!$M:$M,E87,'202'!$P:$P,1),0)","v":0},{"$f":"IF('202'!$M$2=1,COUNTIFS('202'!$M:$M,E87,'202'!$P:$P,0),0)","v":0},{"$f":"IF('203'!$M$2=1,COUNTIFS('203'!$M:$M,E87,'203'!$P:$P,1),0)","v":0},{"$f":"IF('203'!$M$2=1,COUNTIFS('203'!$M:$M,E87,'203'!$P:$P,0),0)","v":0},{"$f":"IF('204'!$M$2=1,COUNTIFS('204'!$M:$M,E87,'204'!$P:$P,1),0)","v":0},{"$f":"IF('204'!$M$2=1,COUNTIFS('204'!$M:$M,E87,'204'!$P:$P,0),0)","v":0},{"$f":"IF('205'!$M$2=1,COUNTIFS('205'!$M:$M,E87,'205'!$P:$P,1),0)","v":0},{"$f":"IF('205'!$M$2=1,COUNTIFS('205'!$M:$M,E87,'205'!$P:$P,0),0)","v":0},null,0,null,{"$error":"#DIV/0!"},null,null,null,{"$f":"IF('201'!$M$2=2,COUNTIFS('201'!$M:$M,E87,'201'!$P:$P,1),0)","v":0},{"$f":"IF('201'!$M$2=2,COUNTIFS('201'!$M:$M,E87,'201'!$P:$P,0),0)","v":0},{"$f":"IF('202'!$M$2=2,COUNTIFS('202'!$M:$M,E87,'202'!$P:$P,1),0)","v":0},{"$f":"IF('202'!$M$2=2,COUNTIFS('202'!$M:$M,E87,'202'!$P:$P,0),0)","v":0},{"$f":"IF('203'!$M$2=2,COUNTIFS('203'!$M:$M,E87,'203'!$P:$P,1),0)","v":0},{"$f":"IF('203'!$M$2=2,COUNTIFS('203'!$M:$M,E87,'203'!$P:$P,0),0)","v":0},{"$f":"IF('204'!$M$2=2,COUNTIFS('204'!$M:$M,E87,'204'!$P:$P,1),0)","v":0},{"$f":"IF('204'!$M$2=2,COUNTIFS('204'!$M:$M,E87,'204'!$P:$P,0),0)","v":0},{"$f":"IF('205'!$M$2=2,COUNTIFS('205'!$M:$M,E87,'205'!$P:$P,1),0)","v":0},{"$f":"IF('205'!$M$2=2,COUNTIFS('205'!$M:$M,E87,'205'!$P:$P,0),0)","v":0},null,0,null,{"$error":"#DIV/0!"}]
[6,9,54,null,"6 ∙ 9",{"$f":"IF('201'!$M$2=1,COUNTIFS('201'!$M:$M,E88,'201'!$P:$P,1),0)","v":0},{"$f":"IF('201'!$M$2=1,COUNTIFS('201'!$M:$M,E88,'201'!$P:$P,0),0)","v":0},{"$f":"IF('202'!$M$2=1,COUNTIFS('202'!$M:$M,E88,'202'!$P:$P,1),0)","v":0},{"$f":"IF('202'!$M$2=1,COUNTIFS('202'!$M:$M,E88,'202'!$P:$P,0),0)","v":0},{"$f":"IF('203'!$M$2=1,COUNTIFS('203'!$M:$M,E88,'203'!$P:$P,1),0)","v":0},{"$f":"IF('203'!$M$2=1,COUNTIFS('203'!$M:$M,E88,'203'!$P:$P,0),0)","v":0},{"$f":"IF('204'!$M$2=1,COUNTIFS('204'!$M:$M,E88,'204'!$P:$P,1),0)","v":0},{"$f":"IF('204'!$M$2=1,COUNTIFS('204'!$M:$M,E88,'204'!$P:$P,0),0)","v":0},{"$f":"IF('205'!$M$2=1,COUNTIFS('205'!$M:$M,E88,'205'!$P:$P,1),0)","v":0},{"$f":"IF('205'!$M$2=1,COUNTIFS('205'!$M:$M,E88,'205'!$P:$P,0),0)","v":0},null,0,null,{"$error":"#DIV/0!"},null,null,null,{"$f":"IF('201'!$M$2=2,COUNTIFS('201'!$M:$M,E88,'201'!$P:$P,1),0)","v":0},{"$f":"IF('201'!$M$2=2,COUNTIFS('201'!$M:$M,E88,'201'!$P:$P,0),0)","v":0},{"$f":"IF('202'!$M$2=2,COUNTIFS('202'!$M:$M,E88,'202'!$P:$P,1),0)","v":0},{"$f":"IF('202'!$M$2=2,COUNTIFS('202'!$M:$M,E88,'202'!$P:$P,0),0)","v":0},{"$f":"IF('203'!$M$2=2,COUNTIFS('203'!$M:$M,E88,'203'!$P:$P,1),0)","v":0},{"$f":"IF('203'!$M$2=2,COUNTIFS('203'!$M:$M,E88,'203'!$P:$P,0),0)","v":0},{"$f":"IF('204'!$M$2=2,COUNTIFS('204'!$M:$M,E88,'204'!$P:$P,1),0)","v":0},{"$f":"IF('204'!$M$2=2,COUNTIFS('204'!$M:$M,E88,'204'!$P:$P,0),0)","v":0},{"$f":"IF('205'!$M$2=2,COUNTIFS('205'!$M:$M,E88,'205'!$P:$P,1),0)","v":0},{"$f":"IF('205'!$M$2=2,COUNTIFS('205'!$M:$M,E88,'205'!$P:$P,0),0)","v":0},null,0,null,{"$error":"#DIV/0!"}]
[7,9,63,null,"7 ∙ 9",{"$f":"IF('201'!$M$2=1,COUNTIFS('201'!$M:$M,E89,'201'!$P:$P,1),0)","v":0},{"$f":"IF('201'!$M$2=1,COUNTIFS('201'!$M:$M,E89,'201'!$P:$P,0),0)","v":0},{"$f":"IF('202'!$M$2=1,COUNTIFS('202'!$M:$M,E89,'202'!$P:$P,1),0)","v":0},{"$f":"IF('202'!$M$2=1,COUNTIFS('202'!$M:$M,E89,'202'!$P:$P,0),0)","v":0},{"$f":"IF('203'!$M$2=1,COUNTIFS('203'!$M:$M,E89,'203'!$P:$P,1),0)","v":0},{"$f":"IF('203'!$M$2=1,COUNTIFS('203'!$M:$M,E89,'203'!$P:$P,0),0)","v":0},{"$f":"IF('204'!$M$2=1,COUNTIFS('204'!$M:$M,E89,'204'!$P:$P,1),0)","v":0},{"$f":"IF('204'!$M$2=1,COUNTIFS('204'!$M:$M,E89,'204'!$P:$P,0),0)","v":0},{"$f":"IF('205'!$M$2=1,COUNTIFS('205'!$M:$M,E89,'205'!$P:$P,1),0)","v":0},{"$f":"IF('205'!$M$2=1,COUNTIFS('205'!$M:$M,E89,'205'!$P:$P,0),0)","v":0},null,0,null,{"$error":"#DIV/0!"},null,null,null,{"$f":"IF('201'!$M$2=2,COUNTIFS('201'!$M:$M,E89,'201'!$P:$P,1),0)","v":0},{"$f":"IF('201'!$M$2=2,COUNTIFS('201'!$M:$M,E89,'201'!$P:$P,0),0)","v":0},{"$f":"IF('202'!$M$2=2,COUNTIFS('202'!$M:$M,E89,'202'!$P:$P,1),0)","v":0},{"$f":"IF('202'!$M$2=2,COUNTIFS('202'!$M:$M,E89,'202'!$P:$P,0),0)","v":0},{"$f":"IF('203'!$M$2=2,COUNTIFS('203'!$M:$M,E89,'203'!$P:$P,1),0)","v":0},{"$f":"IF('203'!$M$2=2,COUNTIFS('203'!$M:$M,E89,'203'!$P:$P,0),0)","v":0},{"$f":"IF('204'!$M$2=2,COUNTIFS('204'!$M:$M,E89,'204'!$P:$P,1),0)","v":0},{"$f":"IF('204'!$M$2=2,COUNTIFS('204'!$M:$M,E89,'204'!$P:$P,0),0)","v":0},{"$f":"IF('205'!$M$2=2,COUNTIFS('205'!$M:$M,E89,'205'!$P:$P,1),0)","v":0},{"$f":"IF('205'!$M$2=2,COUNTIFS('205'!$M:$M,E89,'205'!$P:$P,0),0)","v":0},null,0,null,{"$error":"#DIV/0!"}]
[8,9,72,null,"8 ∙ 9",{"$f":"IF('201'!$M$2=1,COUNTIFS('201'!$M:$M,E90,'201'!$P:$P,1),0)","v":0},{"$f":"IF('201'!$M$2=1,COUNTIFS('201'!$M:$M,E90,'201'!$P:$P,0),0)","v":0},{"$f":"IF('202'!$M$2=1,COUNTIFS('202'!$M:$M,E90,'202'!$P:$P,1),0)","v":0},{"$f":"IF('202'!$M$2=1,COUNTIFS('202'!$M:$M,E90,'202'!$P:$P,0),0)","v":0},{"$f":"IF('203'!$M$2=1,COUNTIFS('203'!$M:$M,E90,'203'!$P:$P,1),0)","v":0},{"$f":"IF('203'!$M$2=1,COUNTIFS('203'!$M:$M,E90,'203'!$P:$P,0),0)","v":0},{"$f":"IF('204'!$M$2=1,COUNTIFS('204'!$M:$M,E90,'204'!$P:$P,1),0)","v":0},{"$f":"IF('204'!$M$2=1,COUNTIFS('204'!$M:$M,E90,'204'!$P:$P,0),0)","v":0},{"$f":"IF('205'!$M$2=1,COUNTIFS('205'!$M:$M,E90,'205'!$P:$P,1),0)","v":0},{"$f":"IF('205'!$M$2=1,COUNTIFS('205'!$M:$M,E90,'205'!$P:$P,0),0)","v":0},null,0,null,{"$error":"#DIV/0!"},null,null,null,{"$f":"IF('201'!$M$2=2,COUNTIFS('201'!$M:$M,E90,'201'!$P:$P,1),0)","v":0},{"$f":"IF('201'!$M$2=2,COUNTIFS('201'!$M:$M,E90,'201'!$P:$P,0),0)","v":0},{"$f":"IF('202'!$M$2=2,COUNTIFS('202'!$M:$M,E90,'202'!$P:$P,1),0)","v":0},{"$f":"IF('202'!$M$2=2,COUNTIFS('202'!$M:$M,E90,'202'!$P:$P,0),0)","v":0},{"$f":"IF('203'!$M$2=2,COUNTIFS('203'!$M:$M,E90,'203'!$P:$P,1),0)","v":0},{"$f":"IF('203'!$M$2=2,COUNTIFS('203'!$M:$M,E90,'203'!$P:$P,0),0)","v":0},{"$f":"IF('204'!$M$2=2,COUNTIFS('204'!$M:$M,E90,'204'!$P:$P,1),0)","v":0},{"$f":"IF('204'!$M$2=2,COUNTIFS('204'!$M:$M,E90,'204'!$P:$P,0),0)","v":0},{"$f":"IF('205'!$M$2=2,COUNTIFS('205'!$M:$M,E90,'205'!$P:$P,1),0)","v":0},{"$f":"IF('205'!$M$2=2,COUNTIFS('205'!$M:$M,E90,'205'!$P:$P,0),0)","v":0},null,0,null,{"$error":"#DIV/0!"}]
[9,9,81,null,"9 ∙ 9",{"$f":"IF('201'!$M$2=1,COUNTIFS('201'!$M:$M,E91,'201'!$P:$P,1),0)","v":0},{"$f":"IF('201'!$M$2=1,COUNTIFS('201'!$M:$M,E91,'201'!$P:$P,0),0)","v":0},{"$f":"IF('202'!$M$2=1,COUNTIFS('202'!$M:$M,E91,'202'!$P:$P,1),0)","v":0},{"$f":"IF('202'!$M$2=1,COUNTIFS('202'!$M:$M,E91,'202'!$P:$P,0),0)","v":0},{"$f":"IF('203'!$M$2=1,COUNTIFS('203'!$M:$M,E91,'203'!$P:$P,1),0)","v":0},{"$f":"IF('203'!$M$2=1,COUNTIFS('203'!$M:$M,E91,'203'!$P:$P,0),0)","v":0},{"$f":"IF('204'!$M$2=1,COUNTIFS('204'!$M:$M,E91,'204'!$P:$P,1),0)","v":0},{"$f":"IF('204'!$M$2=1,COUNTIFS('204'!$M:$M,E91,'204'!$P:$P,0),0)","v":0},{"$f":"IF('205'!$M$2=1,COUNTIFS('205'!$M:$M,E91,'205'!$P:$P,1),0)","v":0},{"$f":"IF('205'!$M$2=1,COUNTIFS('205'!$M:$M,E91,'205'!$P:$P,0),0)","v":0},null,0,null,{"$error":"#DIV/0!"},null,null,null,{"$f":"IF('201'!$M$2=2,COUNTIFS('201'!$M:$M,E91,'201'!$P:$P,1),0)","v":0},{"$f":"IF('201'!$M$2=2,COUNTIFS('201'!$M:$M,E91,'201'!$P:$P,0),0)","v":0},{"$f":"IF('202'!$M$2=2,COUNTIFS('202'!$M:$M,E91,'202'!$P:$P,1),0)","v":0},{"$f":"IF('202'!$M$2=2,COUNTIFS('202'!$M:$M,E91,'202'!$P:$P,0),0)","v":0},{"$f":"IF('203'!$M$2=2,COUNTIFS('203'!$M:$M,E91,'203'!$P:$P,1),0)","v":0},{"$f":"IF('203'!$M$2=2,COUNTIFS('203'!$M:$M,E91,'203'!$P:$P,0),0)","v":0},{"$f":"IF('204'!$M$2=2,COUNTIFS('204'!$M:$M,E91,'204'!$P:$P,1),0)","v":0},{"$f":"IF('204'!$M$2=2,COUNTIFS('204'!$M:$M,E91,'204'!$P:$P,0),0)","v":0},{"$f":"IF('205'!$M$2=2,COUNTIFS('205'!$M:$M,E91,'205'!$P:$P,1),0)","v":0},{"$f":"IF('205'!$M$2=2,COUNTIFS('205'!$M:$M,E91,'205'!$P:$P,0),0)","v":0},null,0,null,{"$error":"#DIV/0!"}]
[10,9,90,null,"10 ∙ 9",{"$f":"IF('201'!$M$2=1,COUNTIFS('201'!$M:$M,E92,'201'!$P:$P,1),0)","v":0},{"$f":"IF('201'!$M$2=1,COUNTIFS('201'!$M:$M,E92,'201'!$P:$P,0),0)","v":0},{"$f":"IF('202'!$M$2=1,COUNTIFS('202'!$M:$M,E92,'202'!$P:$P,1),0)","v":0},{"$f":"IF('202'!$M$2=1,COUNTIFS('202'!$M:$M,E92,'202'!$P:$P,0),0)","v":0},{"$f":"IF('203'!$M$2=1,COUNTIFS('203'!$M:$M,E92,'203'!$P:$P,1),0)","v":0},{"$f":"IF('203'!$M$2=1,COUNTIFS('203'!$M:$M,E92,'203'!$P:$P,0),0)","v":0},{"$f":"IF('204'!$M$2=1,COUNTIFS('204'!$M:$M,E92,'204'!$P:$P,1),0)","v":0},{"$f":"IF('204'!$M$2=1,COUNTIFS('204'!$M:$M,E92,'204'!$P:$P,0),0)","v":0},{"$f":"IF('205'!$M$2=1,COUNTIFS('205'!$M:$M,E92,'205'!$P:$P,1),0)","v":0},{"$f":"IF('205'!$M$2=1,COUNTIFS('205'!$M:$M,E92,'205'!$P:$P,0),0)","v":0},null,0,null,{"$error":"#DIV/0!"},null,null,null,{"$f":"IF('201'!$M$2=2,COUNTIFS('201'!$M:$M,E92,'201'!$P:$P,1),0)","v":0},{"$f":"IF('201'!$M$2=2,COUNTIFS('201'!$M:$M,E92,'201'!$P:$P,0),0)","v":0},{"$f":"IF('202'!$M$2=2,COUNTIFS('202'!$M:$M,E92,'202'!$P:$P,1),0)","v":0},{"$f":"IF('202'!$M$2=2,COUNTIFS('202'!$M:$M,E92,'202'!$P:$P,0),0)","v":0},{"$f":"IF('203'!$M$2=2,COUNTIFS('203'!$M:$M,E92,'203'!$P:$P,1),0)","v":0},{"$f":"IF('203'!$M$2=2,COUNTIFS('203'!$M:$M,E92,'203'!$P:$P,0),0)","v":0},{"$f":"IF('204'!$M$2=2,COUNTIFS('204'!$M:$M,E92,'204'!$P:$P,1),0)","v":0},{"$f":"IF('204'!$M$2=2,COUNTIFS('204'!$M:$M,E92,'204'!$P:$P,0),0)","v":0},{"$f":"IF('205'!$M$2=2,COUNTIFS('205'!$M:$M,E92,'205'!$P:$P,1),0)","v":0},{"$f":"IF('205'!$M$2=2,COUNTIFS('205'!$M:$M,E92,'205'!$P:$P,0),0)","v":0},null,0,null,{"$error":"#DIV/0!"}]
[1,10,10,null,"1 ∙ 10",{"$f":"IF('201'!$M$2=1,COUNTIFS('201'!$M:$M,E93,'201'!$P:$P,1),0)","v":0},{"$f":"IF('201'!$M$2=1,COUNTIFS('201'!$M:$M,E93,'201'!$P:$P,0),0)","v":0},{"$f":"IF('202'!$M$2=1,COUNTIFS('202'!$M:$M,E93,'202'!$P:$P,1),0)","v":0},{"$f":"IF('202'!$M$2=1,COUNTIFS('202'!$M:$M,E93,'202'!$P:$P,0),0)","v":0},{"$f":"IF('203'!$M$2=1,COUNTIFS('203'!$M:$M,E93,'203'!$P:$P,1),0)","v":0},{"$f":"IF('203'!$M$2=1,COUNTIFS('203'!$M:$M,E93,'203'!$P:$P,0),0)","v":0},{"$f":"IF('204'!$M$2=1,COUNTIFS('204'!$M:$M,E93,'204'!$P:$P,1),0)","v":0},{"$f":"IF('204'!$M$2=1,COUNTIFS('204'!$M:$M,E93,'204'!$P:$P,0),0)","v":0},{"$f":"IF('205'!$M$2=1,COUNTIFS('205'!$M:$M,E93,'205'!$P:$P,1),0)","v":0},{"$f":"IF('205'!$M$2=1,COUNTIFS('205'!$M:$M,E93,'205'!$P:$P,0),0)","v":0},null,0,null,{"$error":"#DIV/0!"},null,null,null,{"$f":"IF('201'!$M$2=2,COUNTIFS('201'!$M:$M,E93,'201'!$P:$P,1),0)","v":0},{"$f":"IF('201'!$M$2=2,COUNTIFS('201'!$M:$M,E93,'201'!$P:$P,0),0)","v":0},{"$f":"IF('202'!$M$2=2,COUNTIFS('202'!$M:$M,E93,'202'!$P:$P,1),0)","v":0},{"$f":"IF('202'!$M$2=2,COUNTIFS('202'!$M:$M,E93,'202'!$P:$P,0),0)","v":0},{"$f":"IF('203'!$M$2=2,COUNTIFS('203'!$M:$M,E93,'203'!$P:$P,1),0)","v":0},{"$f":"IF('203'!$M$2=2,COUNTIFS('203'!$M:$M,E93,'203'!$P:$P,0),0)","v":0},{"$f":"IF('204'!$M$2=2,COUNTIFS('204'!$M:$M,E93,'204'!$P:$P,1),0)","v":0},{"$f":"IF('204'!$M$2=2,COUNTIFS('204'!$M:$M,E93,'204'!$P:$P,0),0)","v":0},{"$f":"IF('205'!$M$2=2,COUNTIFS('205'!$M:$M,E93,'205'!$P:$P,1),0)","v":0},{"$f":"IF('205'!$M$2=2,COUNTIFS('205'!$M:$M,E93,'205'!$P:$P,0),0)","v":0},null,0,null,{"$error":"#DIV/0!"}]
[2,10,20,null,"2 ∙ 10",{"$f":"IF('201'!$M$2=1,COUNTIFS('201'!$M:$M,E94,'201'!$P:$P,1),0)","v":0},{"$f":"IF('201'!$M$2=1,COUNTIFS('201'!$M:$M,E94,'201'!$P:$P,0),0)","v":0},{"$f":"IF('202'!$M$2=1,COUNTIFS('202'!$M:$M,E94,'202'!$P:$P,1),0)","v":0},{"$f":"IF('202'!$M$2=1,COUNTIFS('202'!$M:$M,E94,'202'!$P:$P,0),0)","v":0},{"$f":"IF('203'!$M$2=1,COUNTIFS('203'!$M:$M,E94,'203'!$P:$P,1),0)","v":0},{"$f":"IF('203'!$M$2=1,COUNTIFS('203'!$M:$M,E94,'203'!$P:$P,0),0)","v":0},{"$f":"IF('204'!$M$2=1,COUNTIFS('204'!$M:$M,E94,'204'!$P:$P,1),0)","v":0},{"$f":"IF('204'!$M$2=1,COUNTIFS('204'!$M:$M,E94,'204'!$P:$P,0),0)","v":0},{"$f":"IF('205'!$M$2=1,COUNTIFS('205'!$M:$M,E94,'205'!$P:$P,1),0)","v":0},{"$f":"IF('205'!$M$2=1,COUNTIFS('205'!$M:$M,E94,'205'!$P:$P,0),0)","v":0},null,0,null,{"$error":"#DIV/0!"},null,null,null,{"$f":"IF('201'!$M$2=2,COUNTIFS('201'!$M:$M,E94,'201'!$P:$P,1),0)","v":0},{"$f":"IF('201'!$M$2=2,COUNTIFS('201'!$M:$M,E94,'201'!$P:$P,0),0)","v":0},{"$f":"IF('202'!$M$2=2,COUNTIFS('202'!$M:$M,E94,'202'!$P:$P,1),0)","v":0},{"$f":"IF('202'!$M$2=2,COUNTIFS('202'!$M:$M,E94,'202'!$P:$P,0),0)","v":0},{"$f":"IF('203'!$M$2=2,COUNTIFS('203'!$M:$M,E94,'203'!$P:$P,1),0)","v":0},{"$f":"IF('203'!$M$2=2,COUNTIFS('203'!$M:$M,E94,'203'!$P:$P,0),0)","v":0},{"$f":"IF('204'!$M$2=2,COUNTIFS('204'!$M:$M,E94,'204'!$P:$P,1),0)","v":0},{"$f":"IF('204'!$M$2=2,COUNTIFS('204'!$M:$M,E94,'204'!$P:$P,0),0)","v":0},{"$f":"IF('205'!$M$2=2,COUNTIFS('205'!$M:$M,E94,'205'!$P:$P,1),0)","v":0},{"$f":"IF('205'!$M$2=2,COUNTIFS('205'!$M:$M,E94,'205'!$P:$P,0),0)","v":0},null,0,null,{"$error":"#DIV/0!"}]
[3,10,30,null,"3 ∙ 10",{"$f":"IF('201'!$M$2=1,COUNTIFS('201'!$M:$M,E95,'201'!$P:$P,1),0)","v":0},{"$f":"IF('201'!$M$2=1,COUNTIFS('201'!$M:$M,E95,'201'!$P:$P,0),0)","v":0},{"$f":"IF('202'!$M$2=1,COUNTIFS('202'!$M:$M,E95,'202'!$P:$P,1),0)","v":0},{"$f":"IF('202'!$M$2=1,COUNTIFS('202'!$M:$M,E95,'202'!$P:$P,0),0)","v":0},{"$f":"IF('203'!$M$2=1,COUNTIFS('203'!$M:$M,E95,'203'!$P:$P,1),0)","v":0},{"$f":"IF('203'!$M$2=1,COUNTIFS('203'!$M:$M,E95,'203'!$P:$P,0),0)","v":0},{"$f":"IF('204'!$M$2=1,COUNTIFS('204'!$M:$M,E95,'204'!$P:$P,1),0)","v":0},{"$f":"IF('204'!$M$2=1,COUNTIFS('204'!$M:$M,E95,'204'!$P:$P,0),0)","v":0},{"$f":"IF('205'!$M$2=1,COUNTIFS('205'!$M:$M,E95,'205'!$P:$P,1),0)","v":0},{"$f":"IF('205'!$M$2=1,COUNTIFS('205'!$M:$M,E95,'205'!$P:$P,0),0)","v":0},null,0,null,{"$error":"#DIV/0!"},null,null,null,{"$f":"IF('201'!$M$2=2,COUNTIFS('201'!$M:$M,E95,'201'!$P:$P,1),0)","v":0},{"$f":"IF('201'!$M$2=2,COUNTIFS('201'!$M:$M,E95,'201'!$P:$P,0),0)","v":0},{"$f":"IF('202'!$M$2=2,COUNTIFS('202'!$M:$M,E95,'202'!$P:$P,1),0)","v":0},{"$f":"IF('202'!$M$2=2,COUNTIFS('202'!$M:$M,E95,'202'!$P:$P,0),0)","v":0},{"$f":"IF('203'!$M$2=2,COUNTIFS('203'!$M:$M,E95,'203'!$P:$P,1),0)","v":0},{"$f":"IF('203'!$M$2=2,COUNTIFS('203'!$M:$M,E95,'203'!$P:$P,0),0)","v":0},{"$f":"IF('204'!$M$2=2,COUNTIFS('204'!$M:$M,E95,'204'!$P:$P,1),0)","v":0},{"$f":"IF('204'!$M$2=2,COUNTIFS('204'!$M:$M,E95,'204'!$P:$P,0),0)","v":0},{"$f":"IF('205'!$M$2=2,COUNTIFS('205'!$M:$M,E95,'205'!$P:$P,1),0)","v":0},{"$f":"IF('205'!$M$2=2,COUNTIFS('205'!$M:$M,E95,'205'!$P:$P,0),0)","v":0},null,0,null,{"$error":"#DIV/0!"}]
[4,10,40,null,"4 ∙ 10",{"$f":"IF('201'!$M$2=1,COUNTIFS('201'!$M:$M,E96,'201'!$P:$P,1),0)","v":0},{"$f":"IF('201'!$M$2=1,COUNTIFS('201'!$M:$M,E96,'201'!$P:$P,0),0)","v":0},{"$f":"IF('202'!$M$2=1,COUNTIFS('202'!$M:$M,E96,'202'!$P:$P,1),0)","v":0},{"$f":"IF('202'!$M$2=1,COUNTIFS('202'!$M:$M,E96,'202'!$P:$P,0),0)","v":0},{"$f":"IF('203'!$M$2=1,COUNTIFS('203'!$M:$M,E96,'203'!$P:$P,1),0)","v":0},{"$f":"IF('203'!$M$2=1,COUNTIFS('203'!$M:$M,E96,'203'!$P:$P,0),0)","v":0},{"$f":"IF('204'!$M$2=1,COUNTIFS('204'!$M:$M,E96,'204'!$P:$P,1),0)","v":0},{"$f":"IF('204'!$M$2=1,COUNTIFS('204'!$M:$M,E96,'204'!$P:$P,0),0)","v":0},{"$f":"IF('205'!$M$2=1,COUNTIFS('205'!$M:$M,E96,'205'!$P:$P,1),0)","v":0},{"$f":"IF('205'!$M$2=1,COUNTIFS('205'!$M:$M,E96,'205'!$P:$P,0),0)","v":0},null,0,null,{"$error":"#DIV/0!"},null,null,null,{"$f":"IF('201'!$M$2=2,COUNTIFS('201'!$M:$M,E96,'201'!$P:$P,1),0)","v":0},{"$f":"IF('201'!$M$2=2,COUNTIFS('201'!$M:$M,E96,'201'!$P:$P,0),0)","v":0},{"$f":"IF('202'!$M$2=2,COUNTIFS('202'!$M:$M,E96,'202'!$P:$P,1),0)","v":0},{"$f":"IF('202'!$M$2=2,COUNTIFS('202'!$M:$M,E96,'202'!$P:$P,0),0)","v":0},{"$f":"IF('203'!$M$2=2,COUNTIFS('203'!$M:$M,E96,'203'!$P:$P,1),0)","v":0},{"$f":"IF('203'!$M$2=2,COUNTIFS('203'!$M:$M,E96,'203'!$P:$P,0),0)","v":0},{"$f":"IF('204'!$M$2=2,COUNTIFS('204'!$M:$M,E96,'204'!$P:$P,1),0)","v":0},{"$f":"IF('204'!$M$2=2,COUNTIFS('204'!$M:$M,E96,'204'!$P:$P,0),0)","v":0},{"$f":"IF('205'!$M$2=2,COUNTIFS('205'!$M:$M,E96,'205'!$P:$P,1),0)","v":0},{"$f":"IF('205'!$M$2=2,COUNTIFS('205'!$M:$M,E96,'205'!$P:$P,0),0)","v":0},null,0,null,{"$error":"#DIV/0!"}]
[5,10,50,null,"5 ∙ 10",{"$f":"IF('201'!$M$2=1,COUNTIFS('201'!$M:$M,E97,'201'!$P:$P,1),0)","v":0},{"$f":"IF('201'!$M$2=1,COUNTIFS('201'!$M:$M,E97,'201'!$P:$P,0),0)","v":0},{"$f":"IF('202'!$M$2=1,COUNTIFS('202'!$M:$M,E97,'202'!$P:$P,1),0)","v":0},{"$f":"IF('202'!$M$2=1,COUNTIFS('202'!$M:$M,E97,'202'!$P:$P,0),0)","v":0},{"$f":"IF('203'!$M$2=1,COUNTIFS('203'!$M:$M,E97,'203'!$P:$P,1),0)","v":0},{"$f":"IF('203'!$M$2=1,COUNTIFS('203'!$M:$M,E97,'203'!$P:$P,0),0)","v":0},{"$f":"IF('204'!$M$2=1,COUNTIFS('204'!$M:$M,E97,'204'!$P:$P,1),0)","v":0},{"$f":"IF('204'!$M$2=1,COUNTIFS('204'!$M:$M,E97,'204'!$P:$P,0),0)","v":0},{"$f":"IF('205'!$M$2=1,COUNTIFS('205'!$M:$M,E97,'205'!$P:$P,1),0)","v":0},{"$f":"IF('205'!$M$2=1,COUNTIFS('205'!$M:$M,E97,'205'!$P:$P,0),0)","v":0},null,0,null,{"$error":"#DIV/0!"},null,null,null,{"$f":"IF('201'!$M$2=2,COUNTIFS('201'!$M:$M,E97,'201'!$P:$P,1),0)","v":0},{"$f":"IF('201'!$M$2=2,COUNTIFS('201'!$M:$M,E97,'201'!$P:$P,0),0)","v":0},{"$f":"IF('202'!$M$2=2,COUNTIFS('202'!$M:$M,E97,'202'!$P:$P,1),0)","v":0},{"$f":"IF('202'!$M$2=2,COUNTIFS('202'!$M:$M,E97,'202'!$P:$P,0),0)","v":0},{"$f":"IF('203'!$M$2=2,COUNTIFS('203'!$M:$M,E97,'203'!$P:$P,1),0)","v":0},{"$f":"IF('203'!$M$2=2,COUNTIFS('203'!$M:$M,E97,'203'!$P:$P,0),0)","v":0},{"$f":"IF('204'!$M$2=2,COUNTIFS('204'!$M:$M,E97,'204'!$P:$P,1),0)","v":0},{"$f":"IF('204'!$M$2=2,COUNTIFS('204'!$M:$M,E97,'204'!$P:$P,0),0)","v":0},{"$f":"IF('205'!$M$2=2,COUNTIFS('205'!$M:$M,E97,'205'!$P:$P,1),0)","v":0},{"$f":"IF('205'!$M$2=2,COUNTIFS('205'!$M:$M,E97,'205'!$P:$P,0),0)","v":0},null,0,null,{"$error":"#DIV/0!"}]
[6,10,60,null,"6 ∙ 10",{"$f":"IF('201'!$M$2=1,COUNTIFS('201'!$M:$M,E98,'201'!$P:$P,1),0)","v":0},{"$f":"IF('201'!$M$2=1,COUNTIFS('201'!$M:$M,E98,'201'!$P:$P,0),0)","v":0},{"$f":"IF('202'!$M$2=1,COUNTIFS('202'!$M:$M,E98,'202'!$P:$P,1),0)","v":0},{"$f":"IF('202'!$M$2=1,COUNTIFS('202'!$M:$M,E98,'202'!$P:$P,0),0)","v":0},{"$f":"IF('203'!$M$2=1,COUNTIFS('203'!$M:$M,E98,'203'!$P:$P,1),0)","v":0},{"$f":"IF('203'!$M$2=1,COUNTIFS('203'!$M:$M,E98,'203'!$P:$P,0),0)","v":0},{"$f":"IF('204'!$M$2=1,COUNTIFS('204'!$M:$M,E98,'204'!$P:$P,1),0)","v":0},{"$f":"IF('204'!$M$2=1,COUNTIFS('204'!$M:$M,E98,'204'!$P:$P,0),0)","v":0},{"$f":"IF('205'!$M$2=1,COUNTIFS('205'!$M:$M,E98,'205'!$P:$P,1),0)","v":0},{"$f":"IF('205'!$M$2=1,COUNTIFS('205'!$M:$M,E98,'205'!$P:$P,0),0)","v":0},null,0,null,{"$error":"#DIV/0!"},null,null,null,{"$f":"IF('201'!$M$2=2,COUNTIFS('201'!$M:$M,E98,'201'!$P:$P,1),0)","v":0},{"$f":"IF('201'!$M$2=2,COUNTIFS('201'!$M:$M,E98,'201'!$P:$P,0),0)","v":0},{"$f":"IF('202'!$M$2=2,COUNTIFS('202'!$M:$M,E98,'202'!$P:$P,1),0)","v":0},{"$f":"IF('202'!$M$2=2,COUNTIFS('202'!$M:$M,E98,'202'!$P:$P,0),0)","v":0},{"$f":"IF('203'!$M$2=2,COUNTIFS('203'!$M:$M,E98,'203'!$P:$P,1),0)","v":0},{"$f":"IF('203'!$M$2=2,COUNTIFS('203'!$M:$M,E98,'203'!$P:$P,0),0)","v":0},{"$f":"IF('204'!$M$2=2,COUNTIFS('204'!$M:$M,E98,'204'!$P:$P,1),0)","v":0},{"$f":"IF('204'!$M$2=2,COUNTIFS('204'!$M:$M,E98,'204'!$P:$P,0),0)","v":0},{"$f":"IF('205'!$M$2=2,COUNTIFS('205'!$M:$M,E98,'205'!$P:$P,1),0)","v":0},{"$f":"IF('205'!$M$2=2,COUNTIFS('205'!$M:$M,E98,'205'!$P:$P,0),0)","v":0},null,0,null,{"$error":"#DIV/0!"}]
[7,10,70,null,"7 ∙ 10",{"$f":"IF('201'!$M$2=1,COUNTIFS('201'!$M:$M,E99,'201'!$P:$P,1),0)","v":0},{"$f":"IF('201'!$M$2=1,COUNTIFS('201'!$M:$M,E99,'201'!$P:$P,0),0)","v":0},{"$f":"IF('202'!$M$2=1,COUNTIFS('202'!$M:$M,E99,'202'!$P:$P,1),0)","v":0},{"$f":"IF('202'!$M$2=1,COUNTIFS('202'!$M:$M,E99,'202'!$P:$P,0),0)","v":0},{"$f":"IF('203'!$M$2=1,COUNTIFS('203'!$M:$M,E99,'203'!$P:$P,1),0)","v":0},{"$f":"IF('203'!$M$2=1,COUNTIFS('203'!$M:$M,E99,'203'!$P:$P,0),0)","v":0},{"$f":"IF('204'!$M$2=1,COUNTIFS('204'!$M:$M,E99,'204'!$P:$P,1),0)","v":0},{"$f":"IF('204'!$M$2=1,COUNTIFS('204'!$M:$M,E99,'204'!$P:$P,0),0)","v":0},{"$f":"IF('205'!$M$2=1,COUNTIFS('205'!$M:$M,E99,'205'!$P:$P,1),0)","v":0},{"$f":"IF('205'!$M$2=1,COUNTIFS('205'!$M:$M,E99,'205'!$P:$P,0),0)","v":0},null,0,null,{"$error":"#DIV/0!"},null,null,null,{"$f":"IF('201'!$M$2=2,COUNTIFS('201'!$M:$M,E99,'201'!$P:$P,1),0)","v":0},{"$f":"IF('201'!$M$2=2,COUNTIFS('201'!$M:$M,E99,'201'!$P:$P,0),0)","v":0},{"$f":"IF('202'!$M$2=2,COUNTIFS('202'!$M:$M,E99,'202'!$P:$P,1),0)","v":0},{"$f":"IF('202'!$M$2=2,COUNTIFS('202'!$M:$M,E99,'202'!$P:$P,0),0)","v":0},{"$f":"IF('203'!$M$2=2,COUNTIFS('203'!$M:$M,E99,'203'!$P:$P,1),0)","v":0},{"$f":"IF('203'!$M$2=2,COUNTIFS('203'!$M:$M,E99,'203'!$P:$P,0),0)","v":0},{"$f":"IF('204'!$M$2=2,COUNTIFS('204'!$M:$M,E99,'204'!$P:$P,1),0)","v":0},{"$f":"IF('204'!$M$2=2,COUNTIFS('204'!$M:$M,E99,'204'!$P:$P,0),0)","v":0},{"$f":"IF('205'!$M$2=2,COUNTIFS('205'!$M:$M,E99,'205'!$P:$P,1),0)","v":0},{"$f":"IF('205'!$M$2=2,COUNTIFS('205'!$M:$M,E99,'205'!$P:$P,0),0)","v":0},null,0,null,{"$error":"#DIV/0!"}]
[8,10,80,null,"8 ∙ 10",{"$f":"IF('201'!$M$2=1,COUNTIFS('201'!$M:$M,E100,'201'!$P:$P,1),0)","v":0},{"$f":"IF('201'!$M$2=1,COUNTIFS('201'!$M:$M,E100,'201'!$P:$P,0),0)","v":0},{"$f":"IF('202'!$M$2=1,COUNTIFS('202'!$M:$M,E100,'202'!$P:$P,1),0)","v":0},{"$f":"IF('202'!$M$2=1,COUNTIFS('202'!$M:$M,E100,'202'!$P:$P,0),0)","v":0},{"$f":"IF('203'!$M$2=1,COUNTIFS('203'!$M:$M,E100,'203'!$P:$P,1),0)","v":0},{"$f":"IF('203'!$M$2=1,COUNTIFS('203'!$M:$M,E100,'203'!$P:$P,0),0)","v":0},{"$f":"IF('204'!$M$2=1,COUNTIFS('204'!$M:$M,E100,'204'!$P:$P,1),0)","v":0},{"$f":"IF('204'!$M$2=1,COUNTIFS('204'!$M:$M,E100,'204'!$P:$P,0),0)","v":0},{"$f":"IF('205'!$M$2=1,COUNTIFS('205'!$M:$M,E100,'205'!$P:$P,1),0)","v":0},{"$f":"IF('205'!$M$2=1,COUNTIFS('205'!$M:$M,E100,'205'!$P:$P,0),0)","v":0},null,0,null,{"$error":"#DIV/0!"},null,null,null,{"$f":"IF('201'!$M$2=2,COUNTIFS('201'!$M:$M,E100,'201'!$P:$P,1),0)","v":0},{"$f":"IF('201'!$M$2=2,COUNTIFS('201'!$M:$M,E100,'201'!$P:$P,0),0)","v":0},{"$f":"IF('202'!$M$2=2,COUNTIFS('202'!$M:$M,E100,'202'!$P:$P,1),0)","v":0},{"$f":"IF('202'!$M$2=2,COUNTIFS('202'!$M:$M,E100,'202'!$P:$P,0),0)","v":0},{"$f":"IF('203'!$M$2=2,COUNTIFS('203'!$M:$M,E100,'203'!$P:$P,1),0)","v":0},{"$f":"IF('203'!$M$2=2,COUNTIFS('203'!$M:$M,E100,'203'!$P:$P,0),0)","v":0},{"$f":"IF('204'!$M$2=2,COUNTIFS('204'!$M:$M,E100,'204'!$P:$P,1),0)","v":0},{"$f":"IF('204'!$M$2=2,COUNTIFS('204'!$M:$M,E100,'204'!$P:$P,0),0)","v":0},{"$f":"IF('205'!$M$2=2,COUNTIFS('205'!$M:$M,E100,'205'!$P:$P,1),0)","v":0},{"$f":"IF('205'!$M$2=2,COUNTIFS('205'!$M:$M,E100,'205'!$P:$P,0),0)","v":0},null,0,null,{"$error":"#DIV/0!"}]
[9,10,90,null,"9 ∙ 10",{"$f":"IF('201'!$M$2=1,COUNTIFS('201'!$M:$M,E101,'201'!$P:$P,1),0)","v":0},{"$f":"IF('201'!$M$2=1,COUNTIFS('201'!$M:$M,E101,'201'!$P:$P,0),0)","v":0},{"$f":"IF('202'!$M$2=1,COUNTIFS('202'!$M:$M,E101,'202'!$P:$P,1),0)","v":0},{"$f":"IF('202'!$M$2=1,COUNTIFS('202'!$M:$M,E101,'202'!$P:$P,0),0)","v":0},{"$f":"IF('203'!$M$2=1,COUNTIFS('203'!$M:$M,E101,'203'!$P:$P,1),0)","v":0},{"$f":"IF('203'!$M$2=1,COUNTIFS('203'!$M:$M,E101,'203'!$P:$P,0),0)","v":0},{"$f":"IF('204'!$M$2=1,COUNTIFS('204'!$M:$M,E101,'204'!$P:$P,1),0)","v":0},{"$f":"IF('204'!$M$2=1,COUNTIFS('204'!$M:$M,E101,'204'!$P:$P,0),0)","v":0},{"$f":"IF('205'!$M$2=1,COUNTIFS('205'!$M:$M,E101,'205'!$P:$P,1),0)","v":0},{"$f":"IF('205'!$M$2=1,COUNTIFS('205'!$M:$M,E101,'205'!$P:$P,0),0)","v":0},null,0,null,{"$error":"#DIV/0!"},null,null,null,{"$f":"IF('201'!$M$2=2,COUNTIFS('201'!$M:$M,E101,'201'!$P:$P,1),0)","v":0},{"$f":"IF('201'!$M$2=2,COUNTIFS('201'!$M:$M,E101,'201'!$P:$P,0),0)","v":0},{"$f":"IF('202'!$M$2=2,COUNTIFS('202'!$M:$M,E101,'202'!$P:$P,1),0)","v":0},{"$f":"IF('202'!$M$2=2,COUNTIFS('202'!$M:$M,E101,'202'!$P:$P,0),0)","v":0},{"$f":"IF('203'!$M$2=2,COUNTIFS('203'!$M:$M,E101,'203'!$P:$P,1),0)","v":0},{"$f":"IF('203'!$M$2=2,COUNTIFS('203'!$M:$M,E101,'203'!$P:$P,0),0)","v":0},{"$f":"IF('204'!$M$2=2,COUNTIFS('204'!$M:$M,E101,'204'!$P:$P,1),0)","v":0},{"$f":"IF('204'!$M$2=2,COUNTIFS('204'!$M:$M,E101,'204'!$P:$P,0),0)","v":0},{"$f":"IF('205'!$M$2=2,COUNTIFS('205'!$M:$M,E101,'205'!$P:$P,1),0)","v":0},{"$f":"IF('205'!$M$2=2,COUNTIFS('205'!$M:$M,E101,'205'!$P:$P,0),0)","v":0},null,0,null,{"$error":"#DIV/0!"}]
[10,10,100,null,"10 ∙ 10",{"$f":"IF('201'!$M$2=1,COUNTIFS('201'!$M:$M,E102,'201'!$P:$P,1),0)","v":0},{"$f":"IF('201'!$M$2=1,COUNTIFS('201'!$M:$M,E102,'201'!$P:$P,0),0)","v":0},{"$f":"IF('202'!$M$2=1,COUNTIFS('202'!$M:$M,E102,'202'!$P:$P,1),0)","v":0},{"$f":"IF('202'!$M$2=1,COUNTIFS('202'!$M:$M,E102,'202'!$P:$P,0),0)","v":0},{"$f":"IF('203'!$M$2=1,COUNTIFS('203'!$M:$M,E102,'203'!$P:$P,1),0)","v":0},{"$f":"IF('203'!$M$2=1,COUNTIFS('203'!$M:$M,E102,'203'!$P:$P,0),0)","v":0},{"$f":"IF('204'!$M$2=1,COUNTIFS('204'!$M:$M,E102,'204'!$P:$P,1),0)","v":0},{"$f":"IF('204'!$M$2=1,COUNTIFS('204'!$M:$M,E102,'204'!$P:$P,0),0)","v":0},{"$f":"IF('205'!$M$2=1,COUNTIFS('205'!$M:$M,E102,'205'!$P:$P,1),0)","v":0},{"$f":"IF('205'!$M$2=1,COUNTIFS('205'!$M:$M,E102,'205'!$P:$P,0),0)","v":0},null,0,null,{"$error":"#DIV/0!"},null,null,null,{"$f":"IF('201'!$M$2=2,COUNTIFS('201'!$M:$M,E102,'201'!$P:$P,1),0)","v":0},{"$f":"IF('201'!$M$2=2,COUNTIFS('201'!$M:$M,E102,'201'!$P:$P,0),0)","v":0},{"$f":"IF('202'!$M$2=2,COUNTIFS('202'!$M:$M,E102,'202'!$P:$P,1),0)","v":0},{"$f":"IF('202'!$M$2=2,COUNTIFS('202'!$M:$M,E102,'202'!$P:$P,0),0)","v":0},{"$f":"IF('203'!$M$2=2,COUNTIFS('203'!$M:$M,E102,'203'!$P:$P,1),0)","v":0},{"$f":"IF('203'!$M$2=2,COUNTIFS('203'!$M:$M,E102,'203'!$P:$P,0),0)","v":0},{"$f":"IF('204'!$M$2=2,COUNTIFS('204'!$M:$M,E102,'204'!$P:$P,1),0)","v":0},{"$f":"IF('204'!$M$2=2,COUNTIFS('204'!$M:$M,E102,'204'!$P:$P,0),0)","v":0},{"$f":"IF('205'!$M$2=2,COUNTIFS('205'!$M:$M,E102,'205'!$P:$P,1),0)","v":0},{"$f":"IF('205'!$M$2=2,COUNTIFS('205'!$M:$M,E102,'205'!$P:$P,0),0)","v":0},null,0,null,{"$error":"#DIV/0!"}]
[null,null,null,null,null,{"$f":"SUM(F3:F102)","v":0},{"$f":"SUM(G3:G102)","v":0},{"$f":"SUM(H3:H102)","v":0},{"$f":"SUM(I3:I102)","v":0},{"$f":"SUM(J3:J102)","v":0},{"$f":"SUM(K3:K102)","v":0},0,0,{"$f":"SUM(N3:N102)","v":0},{"$f":"SUM(O3:O102)","v":0},null,0,null,{"$error":"#DIV/0!"},null,null,null,{"$f":"SUM(W3:W102)","v":0},{"$f":"SUM(X3:X102)","v":0},{"$f":"SUM(Y3:Y102)","v":0},{"$f":"SUM(Z3:Z102)","v":0},{"$f":"SUM(AA3:AA102)","v":0},{"$f":"SUM(AB3:AB102)","v":0},0,0,{"$f":"SUM(AE3:AE102)","v":0},{"$f":"SUM(AF3:AF102)","v":0},null,0,null,{"$error":"#DIV/0!"}]

{"sheet":"poštevanka po spolu","index":6,"n_rows":44,"n_cols":25,"rows_kept":44,"cut":false,"hidden":true,"merged":[[0,15,0,24],[16,15,16,24],[31,15,31,24]]}
[null,null,null,null,null,null,null,null,null,null,null,null,null,null,null,"PRAVILNI ODGOVORI - ŽENSKE"]
[]
[null,null,1,2,3,4,5,6,7,8,9,10,null,null,null,1,2,3,4,5,6,7,8,9,10]
[null,1,{"$f":"$B$4*C3","v":1},{"$f":"$B$4*D3","v":2},3,4,5,6,7,8,9,10,null,null,1,{"$f":"'Zbirnik po spolu'!S3","v":{"$error":"#DIV/0!"}},{"$f":"'Zbirnik po spolu'!S13","v":{"$error":"#DIV/0!"}},{"$f":"'Zbirnik po spolu'!$S23","v":{"$error":"#DIV/0!"}},{"$f":"'Zbirnik po spolu'!$S33","v":{"$error":"#DIV/0!"}},{"$f":"'Zbirnik po spolu'!$S43","v":{"$error":"#DIV/0!"}},{"$f":"'Zbirnik po spolu'!$S53","v":{"$error":"#DIV/0!"}},{"$f":"'Zbirnik po spolu'!$S63","v":{"$error":"#DIV/0!"}},{"$f":"'Zbirnik po spolu'!$S73","v":{"$error":"#DIV/0!"}},{"$f":"'Zbirnik po spolu'!$S83","v":{"$error":"#DIV/0!"}},{"$f":"'Zbirnik po spolu'!$S93","v":{"$error":"#DIV/0!"}}]
[null,2,{"$f":"$B$5*C3","v":2},{"$f":"$B$5*D3","v":4},6,8,10,12,14,16,18,20,null,null,2,{"$f":"'Zbirnik po spolu'!S4","v":{"$error":"#DIV/0!"}},{"$f":"'Zbirnik po spolu'!S14","v":{"$error":"#DIV/0!"}},{"$f":"'Zbirnik po spolu'!$S24","v":{"$error":"#DIV/0!"}},{"$f":"'Zbirnik po spolu'!$S24","v":{"$error":"#DIV/0!"}},{"$f":"'Zbirnik po spolu'!$S44","v":{"$error":"#DIV/0!"}},{"$f":"'Zbirnik po spolu'!$S54","v":{"$error":"#DIV/0!"}},{"$f":"'Zbirnik po spolu'!$S64","v":{"$error":"#DIV/0!"}},{"$f":"'Zbirnik po spolu'!$S74","v":{"$error":"#DIV/0!"}},{"$f":"'Zbirnik po spolu'!$S84","v":{"$error":"#DIV/0!"}},{"$f":"'Zbirnik po spolu'!$S94","v":{"$error":"#DIV/0!"}}]
[null,3,{"$f":"$B$6*C3","v":3},{"$f":"$B$6*D3","v":6},9,12,15,18,21,24,27,30,null,null,3,{"$f":"'Zbirnik po spolu'!S5","v":{"$error":"#DIV/0!"}},{"$f":"'Zbirnik po spolu'!S15","v":{"$error":"#DIV/0!"}},{"$f":"'Zbirnik po spolu'!$S25","v":{"$error":"#DIV/0!"}},{"$f":"'Zbirnik po spolu'!$S25","v":{"$error":"#DIV/0!"}},{"$f":"'Zbirnik po spolu'!$S45","v":{"$error":"#DIV/0!"}},{"$f":"'Zbirnik po spolu'!$S55","v":{"$error":"#DIV/0!"}},{"$f":"'Zbirnik po spolu'!$S65","v":{"$error":"#DIV/0!"}},{"$f":"'Zbirnik po spolu'!$S75","v":{"$error":"#DIV/0!"}},{"$f":"'Zbirnik po spolu'!$S85","v":{"$error":"#DIV/0!"}},{"$f":"'Zbirnik po spolu'!$S95","v":{"$error":"#DIV/0!"}}]
[null,4,{"$f":"$B$7*C3","v":4},{"$f":"$B$7*D3","v":8},12,16,20,24,28,32,36,40,null,null,4,{"$f":"'Zbirnik po spolu'!S6","v":{"$error":"#DIV/0!"}},{"$f":"'Zbirnik po spolu'!S16","v":{"$error":"#DIV/0!"}},{"$f":"'Zbirnik po spolu'!$S26","v":{"$error":"#DIV/0!"}},{"$f":"'Zbirnik po spolu'!$S26","v":{"$error":"#DIV/0!"}},{"$f":"'Zbirnik po spolu'!$S46","v":{"$error":"#DIV/0!"}},{"$f":"'Zbirnik po spolu'!$S56","v":{"$error":"#DIV/0!"}},{"$f":"'Zbirnik po spolu'!$S66","v":{"$error":"#DIV/0!"}},{"$f":"'Zbirnik po spolu'!$S76","v":{"$error":"#DIV/0!"}},{"$f":"'Zbirnik po spolu'!$S86","v":{"$error":"#DIV/0!"}},{"$f":"'Zbirnik po spolu'!$S96","v":{"$error":"#DIV/0!"}}]
[null,5,{"$f":"$B$8*C3","v":5},{"$f":"$B$8*D3","v":10},15,20,25,30,35,40,45,50,null,null,5,{"$f":"'Zbirnik po spolu'!S7","v":{"$error":"#DIV/0!"}},{"$f":"'Zbirnik po spolu'!S17","v":{"$error":"#DIV/0!"}},{"$f":"'Zbirnik po spolu'!$S27","v":{"$error":"#DIV/0!"}},{"$f":"'Zbirnik po spolu'!$S27","v":{"$error":"#DIV/0!"}},{"$f":"'Zbirnik po spolu'!$S47","v":{"$error":"#DIV/0!"}},{"$f":"'Zbirnik po spolu'!$S57","v":{"$error":"#DIV/0!"}},{"$f":"'Zbirnik po spolu'!$S67","v":{"$error":"#DIV/0!"}},{"$f":"'Zbirnik po spolu'!$S77","v":{"$error":"#DIV/0!"}},{"$f":"'Zbirnik po spolu'!$S87","v":{"$error":"#DIV/0!"}},{"$f":"'Zbirnik po spolu'!$S97","v":{"$error":"#DIV/0!"}}]
[null,6,{"$f":"$B$9*C3","v":6},{"$f":"$B$9*D3","v":12},18,24,30,36,42,48,54,60,null,null,6,{"$f":"'Zbirnik po spolu'!S8","v":{"$error":"#DIV/0!"}},{"$f":"'Zbirnik po spolu'!S18","v":{"$error":"#DIV/0!"}},{"$f":"'Zbirnik po spolu'!$S28","v":{"$error":"#DIV/0!"}},{"$f":"'Zbirnik po spolu'!$S28","v":{"$error":"#DIV/0!"}},{"$f":"'Zbirnik po spolu'!$S48","v":{"$error":"#DIV/0!"}},{"$f":"'Zbirnik po spolu'!$S58","v":{"$error":"#DIV/0!"}},{"$f":"'Zbirnik po spolu'!$S68","v":{"$error":"#DIV/0!"}},{"$f":"'Zbirnik po spolu'!$S78","v":{"$error":"#DIV/0!"}},{"$f":"'Zbirnik po spolu'!$S88","v":{"$error":"#DIV/0!"}},{"$f":"'Zbirnik po spolu'!$S98","v":{"$error":"#DIV/0!"}}]
[null,7,{"$f":"$B$10*C3","v":7},{"$f":"$B$10*D3","v":14},21,28,35,42,49,56,63,70,null,null,7,{"$f":"'Zbirnik po spolu'!S9","v":{"$error":"#DIV/0!"}},{"$f":"'Zbirnik po spolu'!S19","v":{"$error":"#DIV/0!"}},{"$f":"'Zbirnik po spolu'!$S29","v":{"$error":"#DIV/0!"}},{"$f":"'Zbirnik po spolu'!$S29","v":{"$error":"#DIV/0!"}},{"$f":"'Zbirnik po spolu'!$S49","v":{"$error":"#DIV/0!"}},{"$f":"'Zbirnik po spolu'!$S59","v":{"$error":"#DIV/0!"}},{"$f":"'Zbirnik po spolu'!$S69","v":{"$error":"#DIV/0!"}},{"$f":"'Zbirnik po spolu'!$S79","v":{"$error":"#DIV/0!"}},{"$f":"'Zbirnik po spolu'!$S89","v":{"$error":"#DIV/0!"}},{"$f":"'Zbirnik po spolu'!$S99","v":{"$error":"#DIV/0!"}}]
[null,8,{"$f":"$B$11*C3","v":8},{"$f":"$B$11*D3","v":16},24,32,40,48,56,64,72,80,null,null,8,{"$f":"'Zbirnik po spolu'!S10","v":{"$error":"#DIV/0!"}},{"$f":"'Zbirnik po spolu'!S20","v":{"$error":"#DIV/0!"}},{"$f":"'Zbirnik po spolu'!$S30","v":{"$error":"#DIV/0!"}},{"$f":"'Zbirnik po spolu'!$S30","v":{"$error":"#DIV/0!"}},{"$f":"'Zbirnik po spolu'!$S50","v":{"$error":"#DIV/0!"}},{"$f":"'Zbirnik po spolu'!$S60","v":{"$error":"#DIV/0!"}},{"$f":"'Zbirnik po spolu'!$S70","v":{"$error":"#DIV/0!"}},{"$f":"'Zbirnik po spolu'!$S80","v":{"$error":"#DIV/0!"}},{"$f":"'Zbirnik po spolu'!$S90","v":{"$error":"#DIV/0!"}},{"$f":"'Zbirnik po spolu'!$S100","v":{"$error":"#DIV/0!"}}]
[null,9,{"$f":"$B$12*C3","v":9},{"$f":"$B$12*D3","v":18},27,36,45,54,63,72,81,90,null,null,9,{"$f":"'Zbirnik po spolu'!S11","v":{"$error":"#DIV/0!"}},{"$f":"'Zbirnik po spolu'!S21","v":{"$error":"#DIV/0!"}},{"$f":"'Zbirnik po spolu'!$S31","v":{"$error":"#DIV/0!"}},{"$f":"'Zbirnik po spolu'!$S31","v":{"$error":"#DIV/0!"}},{"$f":"'Zbirnik po spolu'!$S51","v":{"$error":"#DIV/0!"}},{"$f":"'Zbirnik po spolu'!$S61","v":{"$error":"#DIV/0!"}},{"$f":"'Zbirnik po spolu'!$S71","v":{"$error":"#DIV/0!"}},{"$f":"'Zbirnik po spolu'!$S81","v":{"$error":"#DIV/0!"}},{"$f":"'Zbirnik po spolu'!$S91","v":{"$error":"#DIV/0!"}},{"$f":"'Zbirnik po spolu'!$S101","v":{"$error":"#DIV/0!"}}]
[null,10,{"$f":"$B$13*C3","v":10},{"$f":"$B$13*D3","v":20},30,40,50,60,70,80,90,100,null,null,10,{"$f":"'Zbirnik po spolu'!S12","v":{"$error":"#DIV/0!"}},{"$f":"'Zbirnik po spolu'!S22","v":{"$error":"#DIV/0!"}},{"$f":"'Zbirnik po spolu'!$S32","v":{"$error":"#DIV/0!"}},{"$f":"'Zbirnik po spolu'!$S32","v":{"$error":"#DIV/0!"}},{"$f":"'Zbirnik po spolu'!$S52","v":{"$error":"#DIV/0!"}},{"$f":"'Zbirnik po spolu'!$S62","v":{"$error":"#DIV/0!"}},{"$f":"'Zbirnik po spolu'!$S72","v":{"$error":"#DIV/0!"}},{"$f":"'Zbirnik po spolu'!$S82","v":{"$error":"#DIV/0!"}},{"$f":"'Zbirnik po spolu'!$S92","v":{"$error":"#DIV/0!"}},{"$f":"'Zbirnik po spolu'!$S102","v":{"$error":"#DIV/0!"}}]
[]
[]
[]
[null,null,null,null,null,null,null,null,null,null,null,null,null,null,null,"PRAVILNI ODGOVORI - MOŠKI"]
[]
[null,null,null,null,null,null,null,null,null,null,null,null,null,null,null,1,2,3,4,5,6,7,8,9,10]
[null,null,null,null,null,null,null,null,null,null,null,null,null,null,1,{"$f":"'Zbirnik po spolu'!AJ3","v":{"$error":"#DIV/0!"}},{"$f":"'Zbirnik po spolu'!AJ13","v":{"$error":"#DIV/0!"}},{"$f":"'Zbirnik po spolu'!AJ22","v":{"$error":"#DIV/0!"}},{"$f":"'Zbirnik po spolu'!AJ32","v":{"$error":"#DIV/0!"}},{"$f":"'Zbirnik po spolu'!AJ42","v":{"$error":"#DIV/0!"}},{"$f":"'Zbirnik po spolu'!AJ52","v":{"$error":"#DIV/0!"}},{"$f":"'Zbirnik po spolu'!AJ62","v":{"$error":"#DIV/0!"}},{"$f":"'Zbirnik po spolu'!AJ72","v":{"$error":"#DIV/0!"}},{"$f":"'Zbirnik po spolu'!AJ82","v":{"$error":"#DIV/0!"}},{"$f":"'Zbirnik po spolu'!AJ92","v":{"$error":"#DIV/0!"}}]
[null,null,null,null,null,null,null,null,null,null,null,null,null,null,2,{"$f":"'Zbirnik po spolu'!AJ4","v":{"$error":"#DIV/0!"}},{"$f":"'Zbirnik po spolu'!AJ14","v":{"$error":"#DIV/0!"}},{"$f":"'Zbirnik po spolu'!AJ23","v":{"$error":"#DIV/0!"}},{"$f":"'Zbirnik po spolu'!AJ33","v":{"$error":"#DIV/0!"}},{"$f":"'Zbirnik po spolu'!AJ43","v":{"$error":"#DIV/0!"}},{"$f":"'Zbirnik po spolu'!AJ53","v":{"$error":"#DIV/0!"}},{"$f":"'Zbirnik po spolu'!AJ63","v":{"$error":"#DIV/0!"}},{"$f":"'Zbirnik po spolu'!AJ73","v":{"$error":"#DIV/0!"}},{"$f":"'Zbirnik po spolu'!AJ83","v":{"$error":"#DIV/0!"}},{"$f":"'Zbirnik po spolu'!AJ93","v":{"$error":"#DIV/0!"}}]
[null,null,null,null,null,null,null,null,null,null,null,null,null,null,3,{"$f":"'Zbirnik po spolu'!AJ5","v":{"$error":"#DIV/0!"}},{"$f":"'Zbirnik po spolu'!AJ15","v":{"$error":"#DIV/0!"}},{"$f":"'Zbirnik po spolu'!AJ24","v":{"$error":"#DIV/0!"}},{"$f":"'Zbirnik po spolu'!AJ34","v":{"$error":"#DIV/0!"}},{"$f":"'Zbirnik po spolu'!AJ44","v":{"$error":"#DIV/0!"}},{"$f":"'Zbirnik po spolu'!AJ54","v":{"$error":"#DIV/0!"}},{"$f":"'Zbirnik po spolu'!AJ64","v":{"$error":"#DIV/0!"}},{"$f":"'Zbirnik po spolu'!AJ74","v":{"$error":"#DIV/0!"}},{"$f":"'Zbirnik po spolu'!AJ84","v":{"$error":"#DIV/0!"}},{"$f":"'Zbirnik po spolu'!AJ94","v":{"$error":"#DIV/0!"}}]
[null,null,null,null,null,null,null,null,null,null,null,null,null,null,4,{"$f":"'Zbirnik po spolu'!AJ6","v":{"$error":"#DIV/0!"}},{"$f":"'Zbirnik po spolu'!AJ16","v":{"$error":"#DIV/0!"}},{"$f":"'Zbirnik po spolu'!AJ25","v":{"$error":"#DIV/0!"}},{"$f":"'Zbirnik po spolu'!AJ35","v":{"$error":"#DIV/0!"}},{"$f":"'Zbirnik po spolu'!AJ45","v":{"$error":"#DIV/0!"}},{"$f":"'Zbirnik po spolu'!AJ55","v":{"$error":"#DIV/0!"}},{"$f":"'Zbirnik po spolu'!AJ65","v":{"$error":"#DIV/0!"}},{"$f":"'Zbirnik po spolu'!AJ75","v":{"$error":"#DIV/0!"}},{"$f":"'Zbirnik po spolu'!AJ85","v":{"$error":"#DIV/0!"}},{"$f":"'Zbirnik po spolu'!AJ95","v":{"$error":"#DIV/0!"}}]
[null,null,null,null,null,null,null,null,null,null,null,null,null,null,5,{"$f":"'Zbirnik po spolu'!AJ7","v":{"$error":"#DIV/0!"}},{"$f":"'Zbirnik po spolu'!AJ17","v":{"$error":"#DIV/0!"}},{"$f":"'Zbirnik po spolu'!AJ26","v":{"$error":"#DIV/0!"}},{"$f":"'Zbirnik po spolu'!AJ36","v":{"$error":"#DIV/0!"}},{"$f":"'Zbirnik po spolu'!AJ46","v":{"$error":"#DIV/0!"}},{"$f":"'Zbirnik po spolu'!AJ56","v":{"$error":"#DIV/0!"}},{"$f":"'Zbirnik po spolu'!AJ66","v":{"$error":"#DIV/0!"}},{"$f":"'Zbirnik po spolu'!AJ76","v":{"$error":"#DIV/0!"}},{"$f":"'Zbirnik po spolu'!AJ86","v":{"$error":"#DIV/0!"}},{"$f":"'Zbirnik po spolu'!AJ96","v":{"$error":"#DIV/0!"}}]
[null,null,null,null,null,null,null,null,null,null,null,null,null,null,6,{"$f":"'Zbirnik po spolu'!AJ8","v":{"$error":"#DIV/0!"}},{"$f":"'Zbirnik po spolu'!AJ18","v":{"$error":"#DIV/0!"}},{"$f":"'Zbirnik po spolu'!AJ27","v":{"$error":"#DIV/0!"}},{"$f":"'Zbirnik po spolu'!AJ37","v":{"$error":"#DIV/0!"}},{"$f":"'Zbirnik po spolu'!AJ47","v":{"$error":"#DIV/0!"}},{"$f":"'Zbirnik po spolu'!AJ57","v":{"$error":"#DIV/0!"}},{"$f":"'Zbirnik po spolu'!AJ67","v":{"$error":"#DIV/0!"}},{"$f":"'Zbirnik po spolu'!AJ77","v":{"$error":"#DIV/0!"}},{"$f":"'Zbirnik po spolu'!AJ87","v":{"$error":"#DIV/0!"}},{"$f":"'Zbirnik po spolu'!AJ97","v":{"$error":"#DIV/0!"}}]
[null,null,null,null,null,null,null,null,null,null,null,null,null,null,7,{"$f":"'Zbirnik po spolu'!AJ9","v":{"$error":"#DIV/0!"}},{"$f":"'Zbirnik po spolu'!AJ19","v":{"$error":"#DIV/0!"}},{"$f":"'Zbirnik po spolu'!AJ28","v":{"$error":"#DIV/0!"}},{"$f":"'Zbirnik po spolu'!AJ38","v":{"$error":"#DIV/0!"}},{"$f":"'Zbirnik po spolu'!AJ48","v":{"$error":"#DIV/0!"}},{"$f":"'Zbirnik po spolu'!AJ58","v":{"$error":"#DIV/0!"}},{"$f":"'Zbirnik po spolu'!AJ68","v":{"$error":"#DIV/0!"}},{"$f":"'Zbirnik po spolu'!AJ78","v":{"$error":"#DIV/0!"}},{"$f":"'Zbirnik po spolu'!AJ88","v":{"$error":"#DIV/0!"}},{"$f":"'Zbirnik po spolu'!AJ98","v":{"$error":"#DIV/0!"}}]
[null,null,null,null,null,null,null,null,null,null,null,null,null,null,8,{"$f":"'Zbirnik po spolu'!AJ10","v":{"$error":"#DIV/0!"}},{"$f":"'Zbirnik po spolu'!AJ20","v":{"$error":"#DIV/0!"}},{"$f":"'Zbirnik po spolu'!AJ29","v":{"$error":"#DIV/0!"}},{"$f":"'Zbirnik po spolu'!AJ39","v":{"$error":"#DIV/0!"}},{"$f":"'Zbirnik po spolu'!AJ49","v":{"$error":"#DIV/0!"}},{"$f":"'Zbirnik po spolu'!AJ59","v":{"$error":"#DIV/0!"}},{"$f":"'Zbirnik po spolu'!AJ69","v":{"$error":"#DIV/0!"}},{"$f":"'Zbirnik po spolu'!AJ79","v":{"$error":"#DIV/0!"}},{"$f":"'Zbirnik po spolu'!AJ89","v":{"$error":"#DIV/0!"}},{"$f":"'Zbirnik po spolu'!AJ99","v":{"$error":"#DIV/0!"}}]
[null,null,null,null,null,null,null,null,null,null,null,null,null,null,9,{"$f":"'Zbirnik po spolu'!AJ11","v":{"$error":"#DIV/0!"}},{"$f":"'Zbirnik po spolu'!AJ21","v":{"$error":"#DIV/0!"}},{"$f":"'Zbirnik po spolu'!AJ30","v":{"$error":"#DIV/0!"}},{"$f":"'Zbirnik po spolu'!AJ40","v":{"$error":"#DIV/0!"}},{"$f":"'Zbirnik po spolu'!AJ50","v":{"$error":"#DIV/0!"}},{"$f":"'Zbirnik po spolu'!AJ60","v":{"$error":"#DIV/0!"}},{"$f":"'Zbirnik po spolu'!AJ70","v":{"$error":"#DIV/0!"}},{"$f":"'Zbirnik po spolu'!AJ80","v":{"$error":"#DIV/0!"}},{"$f":"'Zbirnik po spolu'!AJ90","v":{"$error":"#DIV/0!"}},{"$f":"'Zbirnik po spolu'!AJ100","v":{"$error":"#DIV/0!"}}]
[null,null,null,null,null,null,null,null,null,null,null,null,null,null,10,{"$f":"'Zbirnik po spolu'!AJ12","v":{"$error":"#DIV/0!"}},{"$f":"'Zbirnik po spolu'!AJ22","v":{"$error":"#DIV/0!"}},{"$f":"'Zbirnik po spolu'!AJ31","v":{"$error":"#DIV/0!"}},{"$f":"'Zbirnik po spolu'!AJ41","v":{"$error":"#DIV/0!"}},{"$f":"'Zbirnik po spolu'!AJ51","v":{"$error":"#DIV/0!"}},{"$f":"'Zbirnik po spolu'!AJ61","v":{"$error":"#DIV/0!"}},{"$f":"'Zbirnik po spolu'!AJ71","v":{"$error":"#DIV/0!"}},{"$f":"'Zbirnik po spolu'!AJ81","v":{"$error":"#DIV/0!"}},{"$f":"'Zbirnik po spolu'!AJ91","v":{"$error":"#DIV/0!"}},{"$f":"'Zbirnik po spolu'!AJ101","v":{"$error":"#DIV/0!"}}]
[]
[]
[null,null,null,null,null,null,null,null,null,null,null,null,null,null,null,"PRAVILNI ODGOVORI - Skupaj"]
[]
[null,null,null,null,null,null,null,null,null,null,null,null,null,null,null,1,2,3,4,5,6,7,8,9,10]
[null,null,null,null,null,null,null,null,null,null,null,null,null,null,1,{"$f":"AVERAGE(P4,P20)","v":{"$error":"#DIV/0!"}},{"$error":"#DIV/0!"},{"$error":"#DIV/0!"},{"$error":"#DIV/0!"},{"$error":"#DIV/0!"},{"$error":"#DIV/0!"},{"$error":"#DIV/0!"},{"$error":"#DIV/0!"},{"$error":"#DIV/0!"},{"$error":"#DIV/0!"}]
[null,null,null,null,null,null,null,null,null,null,null,null,null,null,2,{"$f":"AVERAGE(P5,P21)","v":{"$error":"#DIV/0!"}},{"$error":"#DIV/0!"},{"$error":"#DIV/0!"},{"$error":"#DIV/0!"},{"$error":"#DIV/0!"},{"$error":"#DIV/0!"},{"$error":"#DIV/0!"},{"$error":"#DIV/0!"},{"$error":"#DIV/0!"},{"$error":"#DIV/0!"}]
[null,null,null,null,null,null,null,null,null,null,null,null,null,null,3,{"$f":"AVERAGE(P6,P22)","v":{"$error":"#DIV/0!"}},{"$error":"#DIV/0!"},{"$error":"#DIV/0!"},{"$error":"#DIV/0!"},{"$error":"#DIV/0!"},{"$error":"#DIV/0!"},{"$error":"#DIV/0!"},{"$error":"#DIV/0!"},{"$error":"#DIV/0!"},{"$error":"#DIV/0!"}]
[null,null,null,null,null,null,null,null,null,null,null,null,null,null,4,{"$f":"AVERAGE(P7,P23)","v":{"$error":"#DIV/0!"}},{"$error":"#DIV/0!"},{"$error":"#DIV/0!"},{"$error":"#DIV/0!"},{"$error":"#DIV/0!"},{"$error":"#DIV/0!"},{"$error":"#DIV/0!"},{"$error":"#DIV/0!"},{"$error":"#DIV/0!"},{"$error":"#DIV/0!"}]
[null,null,null,null,null,null,null,null,null,null,null,null,null,null,5,{"$f":"AVERAGE(P8,P24)","v":{"$error":"#DIV/0!"}},{"$error":"#DIV/0!"},{"$error":"#DIV/0!"},{"$error":"#DIV/0!"},{"$error":"#DIV/0!"},{"$error":"#DIV/0!"},{"$error":"#DIV/0!"},{"$error":"#DIV/0!"},{"$error":"#DIV/0!"},{"$error":"#DIV/0!"}]
[null,null,null,null,null,null,null,null,null,null,null,null,null,null,6,{"$f":"AVERAGE(P9,P25)","v":{"$error":"#DIV/0!"}},{"$error":"#DIV/0!"},{"$error":"#DIV/0!"},{"$error":"#DIV/0!"},{"$error":"#DIV/0!"},{"$error":"#DIV/0!"},{"$error":"#DIV/0!"},{"$error":"#DIV/0!"},{"$error":"#DIV/0!"},{"$error":"#DIV/0!"}]
[null,null,null,null,null,null,null,null,null,null,null,null,null,null,7,{"$f":"AVERAGE(P10,P26)","v":{"$error":"#DIV/0!"}},{"$error":"#DIV/0!"},{"$error":"#DIV/0!"},{"$error":"#DIV/0!"},{"$error":"#DIV/0!"},{"$error":"#DIV/0!"},{"$error":"#DIV/0!"},{"$error":"#DIV/0!"},{"$error":"#DIV/0!"},{"$error":"#DIV/0!"}]
[null,null,null,null,null,null,null,null,null,null,null,null,null,null,8,{"$f":"AVERAGE(P11,P27)","v":{"$error":"#DIV/0!"}},{"$error":"#DIV/0!"},{"$error":"#DIV/0!"},{"$error":"#DIV/0!"},{"$error":"#DIV/0!"},{"$error":"#DIV/0!"},{"$error":"#DIV/0!"},{"$error":"#DIV/0!"},{"$error":"#DIV/0!"},{"$error":"#DIV/0!"}]
[null,null,null,null,null,null,null,null,null,null,null,null,null,null,9,{"$f":"AVERAGE(P12,P28)","v":{"$error":"#DIV/0!"}},{"$error":"#DIV/0!"},{"$error":"#DIV/0!"},{"$error":"#DIV/0!"},{"$error":"#DIV/0!"},{"$error":"#DIV/0!"},{"$error":"#DIV/0!"},{"$error":"#DIV/0!"},{"$error":"#DIV/0!"},{"$error":"#DIV/0!"}]
[null,null,null,null,null,null,null,null,null,null,null,null,null,null,10,{"$f":"AVERAGE(P13,P29)","v":{"$error":"#DIV/0!"}},{"$error":"#DIV/0!"},{"$error":"#DIV/0!"},{"$error":"#DIV/0!"},{"$error":"#DIV/0!"},{"$error":"#DIV/0!"},{"$error":"#DIV/0!"},{"$error":"#DIV/0!"},{"$error":"#DIV/0!"},{"$error":"#DIV/0!"}]